BDBM50083245 CHEMBL3423033
SMILES Cc1cc2nc(CCNC(=O)c3ccc(cc3)-n3cnnc3)[nH]c2cc1C
InChI Key InChIKey=QNOXZLGNUKPKFJ-UHFFFAOYSA-N
Data  2 KI
PDB links: 1 PDB ID matches this monomer.
  Tab Delimited (TSV)   2D SDfile   Computed 3D by Vconf -m prep SDfile
Find this compound or compounds like it in BindingDB:
Activity Spreadsheet -- Enzyme Inhibition Constant Data from BindingDB
Found 2 hits for monomerid = 50083245
TargetCoagulation factor IX(Homo sapiens (Human))
Merck Research Laboratories
Curated by ChEMBL
LigandPNGBDBM50083245(CHEMBL3423033)
Affinity DataKi:  9.00E+3nM. Assay description: Inhibition of human factor 9a using CH3SO2-D-CHG-Gly-Arg-AFC.AcOH as substrate by fluorescence assay
TargetCoagulation factor X(Homo sapiens (Human))
Merck Research Laboratories
Curated by ChEMBL
LigandPNGBDBM50083245(CHEMBL3423033)
Affinity DataKi: >6.25E+4nM. Assay description: Inhibition of human factor 10a using n-Acetyl-KPR-AFC as substrate by fluorescence assay
In DepthDetails ArticlePubMed