BDBM50109584 (2S)-2-amino-3-mercaptopropanoic acid::(2S)-2-amino-3-sulfanylpropanoic acid::(S)-2-amino-3-mercaptopropanoic acid::CHEMBL171281::D-Cystein::D-Zystein::D-cysteine
SMILES N[C@H](CS)C(O)=O
InChI Key InChIKey=XUJNEKJLAYXESH-UWTATZPHSA-N
Data  1 KI
PDB links: 88 PDB IDs match this monomer.
  Tab Delimited (TSV)   2D SDfile   Computed 3D by Vconf -m prep SDfile
Find this compound or compounds like it in BindingDB:
Activity Spreadsheet -- Enzyme Inhibition Constant Data from BindingDB
Found 1 hit for monomerid = 50109584
TargetCarboxypeptidase A1(Bos taurus (bovine))
Pohang University Of Science And Technology
Curated by ChEMBL
LigandPNGBDBM50109584((2S)-2-amino-3-mercaptopropanoic acid | (2S)-2-ami...)
Affinity DataKi:  2.30E+3nM. Assay description: Inhibition of bovine carboxypeptidase A (CPA) using hippuryl-L-phenylalanine (Hipp-L-Phe) as a substrate.