BDBM50112180 CHEMBL3608688::US10030025, Compound 41::US10836768, Cpd no 41::US11731974, Compound 41::US9422299, 41::US9987274, Compound 41
SMILES C[C@H]1N(CCn2c1nnc2-c1nc(ns1)C(F)(F)F)C(=O)c1ccc(F)cc1
InChI Key InChIKey=RLKUYZTZCXMODG-MRVPVSSYSA-N
Data  8 KI  10 IC50
  Tab Delimited (TSV)   2D SDfile   Computed 3D by Vconf -m prep SDfile
Find this compound or compounds like it in BindingDB:
Activity Spreadsheet -- Enzyme Inhibition Constant Data from BindingDB
Found 18 hits for monomerid = 50112180
TargetNeuromedin-K receptor(Homo sapiens (Human))
Euroscreen
Curated by ChEMBL
LigandPNGBDBM50112180(CHEMBL3608688 | US10030025, Compound 41 | US108367...)
Affinity DataKi:  7.90nM. Assay description: Binding affinity to human recombinant NK3R by radioligand binding assay
In DepthDetails ArticlePubMed
TargetNeuromedin-K receptor(Homo sapiens (Human))
Euroscreen
Curated by ChEMBL
LigandPNGBDBM50112180(CHEMBL3608688 | US10030025, Compound 41 | US108367...)
Affinity DataKi:  11nM. Assay description: The ability of compounds of the invention to inhibit the binding of the NK-3 receptor selective antagonist3 H-SB222200 was assessed by an in vitro ra...
In DepthDetails US Patent
TargetNeuromedin-K receptor(Homo sapiens (Human))
Euroscreen
Curated by ChEMBL
LigandPNGBDBM50112180(CHEMBL3608688 | US10030025, Compound 41 | US108367...)
Affinity DataKi:  11nMpH: 7.4Assay Description:The affinity of compounds of the invention for the human NK-3 receptor was determined by measuring the ability of compounds of the invention to compe...
In DepthDetails US Patent
TargetNeuromedin-K receptor(Homo sapiens (Human))
Euroscreen
Curated by ChEMBL
LigandPNGBDBM50112180(CHEMBL3608688 | US10030025, Compound 41 | US108367...)
Affinity DataKi:  11nM. Assay description: The ability of compounds of the invention to inhibit the binding of the NK-3 receptor selective antagonist3 H-SB222200 was assessed by an in vitro ra...
In DepthDetails US Patent
TargetNeuromedin-K receptor(Homo sapiens (Human))
Euroscreen
Curated by ChEMBL
LigandPNGBDBM50112180(CHEMBL3608688 | US10030025, Compound 41 | US108367...)
Affinity DataKi:  11nM. Assay description: The affinity of compounds of the invention for the human NK-3 receptor was determined by measuring the ability of compounds of the invention to compe...
In DepthDetails US Patent
TargetNeuromedin-K receptor(Homo sapiens (Human))
Euroscreen
Curated by ChEMBL
LigandPNGBDBM50112180(CHEMBL3608688 | US10030025, Compound 41 | US108367...)
Affinity DataKi:  11nM. Assay description: Human NK-3: The ability of compounds of the invention to inhibit the binding of the NK-3 receptor selective antagonist 3H-SB222200 was assessed by an...
In DepthDetails US Patent
TargetNeuromedin-K receptor(Homo sapiens (Human))
Euroscreen
Curated by ChEMBL
LigandPNGBDBM50112180(CHEMBL3608688 | US10030025, Compound 41 | US108367...)
Affinity DataKi:  11nMpH: 7.4Assay Description:The affinity of compounds of the invention for the human NK-3 receptor was determined by measuring the ability of compounds of the invention to compe...
In DepthDetails US Patent
TargetNeuromedin-K receptor(Rattus norvegicus)
Euroscreen
Curated by ChEMBL
LigandPNGBDBM50112180(CHEMBL3608688 | US10030025, Compound 41 | US108367...)
Affinity DataKi:  85nM. Assay description: Binding affinity to rat NK3R
In DepthDetails ArticlePubMed
TargetCytochrome P450 1A2(Homo sapiens (Human))
Euroscreen
Curated by ChEMBL
LigandPNGBDBM50112180(CHEMBL3608688 | US10030025, Compound 41 | US108367...)
Affinity DataIC50:  5.40E+4nM. Assay description: Inhibition of CYP1A2 (unknown origin)
In DepthDetails ArticlePubMed
TargetPotassium voltage-gated channel subfamily H member 2(Homo sapiens (Human))
Euroscreen
Curated by ChEMBL
LigandPNGBDBM50112180(CHEMBL3608688 | US10030025, Compound 41 | US108367...)
Affinity DataIC50:  3.90E+4nM. Assay description: Inhibition of human ERG
In DepthDetails ArticlePubMed
TargetNeuromedin-K receptor(Homo sapiens (Human))
Euroscreen
Curated by ChEMBL
LigandPNGBDBM50112180(CHEMBL3608688 | US10030025, Compound 41 | US108367...)
Affinity DataIC50:  7nM. Assay description: Changes in intracellular calcium levels are a recognized indicator of G protein-coupled receptor activity. The efficacy of compounds of the invention...
In DepthDetails US Patent
TargetCytochrome P450 3A4(Homo sapiens (Human))
Euroscreen
Curated by ChEMBL
LigandPNGBDBM50112180(CHEMBL3608688 | US10030025, Compound 41 | US108367...)
Affinity DataIC50: >1.00E+5nM. Assay description: Inhibition of CYP3A4 (unknown origin)
In DepthDetails ArticlePubMed
TargetCytochrome P450 2C9(Homo sapiens (Human))
Euroscreen
Curated by ChEMBL
LigandPNGBDBM50112180(CHEMBL3608688 | US10030025, Compound 41 | US108367...)
Affinity DataIC50:  4.50E+4nM. Assay description: Inhibition of CYP2C9 (unknown origin)
In DepthDetails ArticlePubMed
TargetCytochrome P450 2D6(Homo sapiens (Human))
Euroscreen
Curated by ChEMBL
LigandPNGBDBM50112180(CHEMBL3608688 | US10030025, Compound 41 | US108367...)
Affinity DataIC50: >1.00E+5nM. Assay description: Inhibition of CYP2D6 (unknown origin)
In DepthDetails ArticlePubMed
TargetNeuromedin-K receptor(Homo sapiens (Human))
Euroscreen
Curated by ChEMBL
LigandPNGBDBM50112180(CHEMBL3608688 | US10030025, Compound 41 | US108367...)
Affinity DataIC50:  7nM. Assay description: Chinese Hamster Ovary recombinant cells expressing the human NK-3 receptor and a construct that encodes the photoprotein apoaequorin were used for th...
In DepthDetails US Patent
TargetNeuromedin-K receptor(Homo sapiens (Human))
Euroscreen
Curated by ChEMBL
LigandPNGBDBM50112180(CHEMBL3608688 | US10030025, Compound 41 | US108367...)
Affinity DataIC50:  6.30nM. Assay description: Antagonist activity against human recombinant NK3R expressed in CHO cells by aequorin functional assay
In DepthDetails ArticlePubMed
TargetCytochrome P450 2C19(Homo sapiens (Human))
Euroscreen
Curated by ChEMBL
LigandPNGBDBM50112180(CHEMBL3608688 | US10030025, Compound 41 | US108367...)
Affinity DataIC50:  5.70E+4nM. Assay description: Inhibition of CYP2C19 (unknown origin)
In DepthDetails ArticlePubMed
TargetNeuromedin-K receptor(Homo sapiens (Human))
Euroscreen
Curated by ChEMBL
LigandPNGBDBM50112180(CHEMBL3608688 | US10030025, Compound 41 | US108367...)
Affinity DataIC50:  7nM. Assay description: Changes in intracellular calcium levels are a recognized indicator of G protein-coupled receptor activity. The efficacy of compounds of the invention...
In DepthDetails US Patent