BDBM50113839 CHEMBL82285::{2-[4-(2-PYRROLIDIN-1-YL-ETHOXY)-PHENYL]-BENZO[B]THIOPHEN-3-YL}-[4-(2-PYRROLIDIN-1-YL-ETHOXY)-PHENYL]-METHANONE::{2-[4-(2-Pyrrolidin-1-yl-ethoxy)-phenyl]-benzo[b]thiophen-3-yl}-[6-(2-pyrrolidin-1-yl-ethoxy)-pyridin-3-yl]-methanone
SMILES O=C(c1c(sc2ccccc12)-c1ccc(OCCN2CCCC2)cc1)c1ccc(OCCN2CCCC2)nc1
InChI Key InChIKey=ZWXFJUPNUWRODU-UHFFFAOYSA-N
Data  1 KI
PDB links: 1 PDB ID matches this monomer.
  Tab Delimited (TSV)   2D SDfile   Computed 3D by Vconf -m prep SDfile
Find this compound or compounds like it in BindingDB:
Activity Spreadsheet -- Enzyme Inhibition Constant Data from BindingDB
Found 1 hit for monomerid = 50113839
TargetProthrombin(Homo sapiens (Human))
University Of Parma
Curated by ChEMBL
LigandPNGBDBM50113839(CHEMBL82285 | {2-[4-(2-PYRROLIDIN-1-YL-ETHOXY)-PHE...)
Affinity DataKi:  374nM. Assay description: Binding affinity against human thrombin