BDBM50148459 CHEMBL4755373
SMILES COc1ccc(cc1OC)-c1cn(C)c(=O)c2cc(sc12)C(=O)NC1CCS(=O)(=O)CC1
InChI Key InChIKey=ZJDRXPZROJHILR-UHFFFAOYSA-N
Data  2 IC50
PDB links: 2 PDB IDs match this monomer.
  Tab Delimited (TSV)   2D SDfile   Computed 3D by Vconf -m prep SDfile
Find this compound or compounds like it in BindingDB:
Activity Spreadsheet -- Enzyme Inhibition Constant Data from BindingDB
Found 2 hits for monomerid = 50148459
LigandPNGBDBM50148459(CHEMBL4755373)
Affinity DataIC50:  120nM. Assay description: Inhibition of BRD9 (unknown origin) incubated in dark for 30 mins by TR-FRET assay
In DepthDetails ArticlePubMed
TargetDual specificity protein kinase CLK1(Mus musculus)
Universit£
Curated by ChEMBL
LigandPNGBDBM50148459(CHEMBL4755373)
Affinity DataIC50:  210nM. Assay description: Inhibition of human plasmin using pyroGlu-Phe-Lys-pNA.HCl
In DepthDetails ArticlePubMed