BDBM50148776 CHEMBL3769988
SMILES Cc1cc(C)nc(SCC(=O)Nc2ncc(Cc3ccccc3)s2)n1
InChI Key InChIKey=LHMBJRUBDQYYSV-UHFFFAOYSA-N
Data  6 IC50
PDB links: 1 PDB ID matches this monomer.
  Tab Delimited (TSV)   2D SDfile   Computed 3D by Vconf -m prep SDfile
Find this compound or compounds like it in BindingDB:
Activity Spreadsheet -- Enzyme Inhibition Constant Data from BindingDB
Found 6 hits for monomerid = 50148776
TargetNAD-dependent protein deacetylase sirtuin-2(Homo sapiens (Human))
Albert-Ludwigs-University Of Freiburg
Curated by ChEMBL
LigandPNGBDBM50148776(CHEMBL3769988)
Affinity DataIC50:  3.75E+3nM. Assay description: Inhibition of N-terminal his6-tagged human SIRT2 (25 to 389 amino acids) using ZMAL as substrate after 4 hrs by fluorescence-based microplate reader ...
TargetNAD-dependent protein deacetylase sirtuin-1(Homo sapiens (Human))
Albert-Ludwigs-University Of Freiburg
Curated by ChEMBL
LigandPNGBDBM50148776(CHEMBL3769988)
Affinity DataIC50: >5.00E+4nM. Assay description: Inhibition of GST-tagged human SIRT1 (133 to 747 amino acids) using ZMAL as substrate after 4 hrs by fluorescence-based microplate reader method
In DepthDetails ArticlePubMed
TargetNAD-dependent protein deacetylase sirtuin-2(Homo sapiens (Human))
Albert-Ludwigs-University Of Freiburg
Curated by ChEMBL
LigandPNGBDBM50148776(CHEMBL3769988)
Affinity DataIC50:  3.70E+3nM. Assay description: Inhibition of human sirtuin 2 (25 to 389 residues) assessed as inhibition of substrate deacetylation using ZMAL as substrate incubated for 4 hrs by f...
TargetNAD-dependent protein deacetylase sirtuin-2(Homo sapiens (Human))
Albert-Ludwigs-University Of Freiburg
Curated by ChEMBL
LigandPNGBDBM50148776(CHEMBL3769988)
Affinity DataIC50:  3.75E+3nM. Assay description: Inhibition of recombinant human His10-tagged Sirt2 (56 to 356 residues) expressed in Escherichia coli BL21(DE3) using Z-(Ac)Lys-AMC as substrate meas...
TargetNAD-dependent protein deacetylase sirtuin-1(Homo sapiens (Human))
Albert-Ludwigs-University Of Freiburg
Curated by ChEMBL
LigandPNGBDBM50148776(CHEMBL3769988)
Affinity DataIC50: >1.00E+5nM. Assay description: Inhibition of recombinant human GST-tagged Sirt1 (133 to 747 residues) using Z-(Ac)Lys-AMC as substrate measured after 4 hrs by high-throughput fluor...
In DepthDetails ArticlePubMed
TargetNAD-dependent protein deacetylase sirtuin-3, mitochondrial(Homo sapiens (Human))
University Of Freiburg
Curated by ChEMBL
LigandPNGBDBM50148776(CHEMBL3769988)
Affinity DataIC50: >1.00E+5nM. Assay description: Inhibition of recombinant human His10-tagged Sirt3 (118 to 395 residues) expressed in Escherichia coli BL21(DE3) using Z-(Ac)Lys-AMC as substrate mea...
In DepthDetails ArticlePubMed