BDBM50159027 CHEMBL3785713
SMILES CCN(CC)S(=O)(=O)c1ccc(O)c(NC(=O)c2[nH]c(C)c(C(N)=O)c2CC)c1
InChI Key InChIKey=BXFSSYQFFSWQEA-UHFFFAOYSA-N
Data  2 Kd
PDB links: 1 PDB ID matches this monomer.
  Tab Delimited (TSV)   2D SDfile   Computed 3D by Vconf -m prep SDfile
Find this compound or compounds like it in BindingDB:
Activity Spreadsheet -- Enzyme Inhibition Constant Data from BindingDB
Found 2 hits for monomerid = 50159027
TargetPeregrin(Homo sapiens (Human))
Albert-Ludwigs-University Of Freiburg
Curated by ChEMBL
LigandPNGBDBM50159027(CHEMBL3785713)
Affinity DataKd:  4.80E+4nM. Assay description: Binding affinity to partial length human BRPF1 by isothermal titration calorimetry
In DepthDetails ArticlePubMed
TargetBromodomain-containing protein 4(Homo sapiens (Human))
Albert-Ludwigs-University Of Freiburg
Curated by ChEMBL
LigandPNGBDBM50159027(CHEMBL3785713)
Affinity DataKd:  810nM. Assay description: Binding affinity to partial length human BRD4 bromodomain 1 by isothermal titration calorimetry