BDBM50167950 3-(4-Chloro-phenylsulfamoyl)-thiophene-2-carboxylic acid::3-[(4-CHLOROANILINO)SULFONYL]THIOPHENE-2-CARBOXYLIC ACID::CHEMBL372227
SMILES OC(=O)c1sccc1S(=O)(=O)Nc1ccc(Cl)cc1
InChI Key InChIKey=YRWKEEDITQJPCZ-UHFFFAOYSA-N
Data  1 KI
PDB links: 1 PDB ID matches this monomer.
  Tab Delimited (TSV)   2D SDfile   Computed 3D by Vconf -m prep SDfile
Find this compound or compounds like it in BindingDB:
Activity Spreadsheet -- Enzyme Inhibition Constant Data from BindingDB
Found 1 hit for monomerid = 50167950
TargetBeta-lactamase(Escherichia coli)
University Of California San Francisco
Curated by ChEMBL
LigandPNGBDBM50167950(3-(4-Chloro-phenylsulfamoyl)-thiophene-2-carboxyli...)
Affinity DataKi:  2.60E+4nM. Assay description: Apparent inhibitory constant against beta-lactamase AmpC from Escherichia coli