BDBM50175447 5-(2-CHLOROBENZYL)-2-FUROIC ACID::5-(2-chlorobenzyl)furan-2-carboxylic acid::CHEMBL197550
SMILES OC(=O)c1ccc(Cc2ccccc2Cl)o1
InChI Key InChIKey=YRUPEIZURHOLHV-UHFFFAOYSA-N
Data  4 IC50
PDB links: 1 PDB ID matches this monomer.
  Tab Delimited (TSV)   2D SDfile   Computed 3D by Vconf -m prep SDfile
Find this compound or compounds like it in BindingDB:
Activity Spreadsheet -- Enzyme Inhibition Constant Data from BindingDB
Found 4 hits for monomerid = 50175447
TargetMethionine aminopeptidase(Escherichia coli (strain K12))
Graduate School Of Chinese Academy Of Sciences
Curated by ChEMBL
LigandPNGBDBM50175447(5-(2-CHLOROBENZYL)-2-FUROIC ACID | 5-(2-chlorobenz...)
Affinity DataIC50:  1.91E+5nM. Assay description: Inhibitory activity against Ni(II) form of Escherichia coli MetAP
TargetMethionine aminopeptidase(Escherichia coli (strain K12))
Graduate School Of Chinese Academy Of Sciences
Curated by ChEMBL
LigandPNGBDBM50175447(5-(2-CHLOROBENZYL)-2-FUROIC ACID | 5-(2-chlorobenz...)
Affinity DataIC50:  1.99E+5nM. Assay description: Inhibitory activity against Fe(II) form of Escherichia coli MetAP
TargetMethionine aminopeptidase(Escherichia coli (strain K12))
Graduate School Of Chinese Academy Of Sciences
Curated by ChEMBL
LigandPNGBDBM50175447(5-(2-CHLOROBENZYL)-2-FUROIC ACID | 5-(2-chlorobenz...)
Affinity DataIC50:  1.58E+5nM. Assay description: Inhibitory activity against Co(II) form of Escherichia coli MetAP
TargetMethionine aminopeptidase(Escherichia coli (strain K12))
Graduate School Of Chinese Academy Of Sciences
Curated by ChEMBL
LigandPNGBDBM50175447(5-(2-CHLOROBENZYL)-2-FUROIC ACID | 5-(2-chlorobenz...)
Affinity DataIC50:  1.22E+3nM. Assay description: Inhibitory activity against Mn(II) form of Escherichia coli MetAP