BDBM50180949 CHEMBL3818599
SMILES ONC(=O)CC[C@@H](Cc1ccc(cc1)C(O)=O)C(O)=O
InChI Key InChIKey=VUDGMYIWOPKVSL-JTQLQIEISA-N
Data  1 IC50
PDB links: 1 PDB ID matches this monomer.
  Tab Delimited (TSV)   2D SDfile   Computed 3D by Vconf -m prep SDfile
Find this compound or compounds like it in BindingDB:
Activity Spreadsheet -- Enzyme Inhibition Constant Data from BindingDB
Found 1 hit for monomerid = 50180949
TargetGlutamate carboxypeptidase 2(Homo sapiens (Human))
Academy Of Sciences Of The Czech Republic
Curated by ChEMBL
LigandPNGBDBM50180949(CHEMBL3818599)
Affinity DataIC50:  97nM. Assay description: Inhibition of human recombinant GCP2 expressed in Schneider 2 cells preincubated for 15 mins using [3H]-NAAG/NAAG as substrate measured after 20 mins...