BDBM50184633 6-(3,4-dichlorophenyl)-2-hydroxy-4-oxohex-2-enoic acid::CHEMBL211028
SMILES OC(=O)C(=O)CC(=O)CCc1ccc(Cl)c(Cl)c1
InChI Key InChIKey=GBTUEYDIOPNXQE-UHFFFAOYSA-N
Data  1 IC50
  Tab Delimited (TSV)   2D SDfile   Computed 3D by Vconf -m prep SDfile
Find this compound or compounds like it in BindingDB:
Activity Spreadsheet -- Enzyme Inhibition Constant Data from BindingDB
Found 1 hit for monomerid = 50184633
TargetIntegrase(Human immunodeficiency virus 1)
Bristol-Myers Squibb
Curated by ChEMBL
LigandPNGBDBM50184633(6-(3,4-dichlorophenyl)-2-hydroxy-4-oxohex-2-enoic ...)
Affinity DataIC50:  10nM. Assay description: Inhibition of HIV integrase
In DepthDetails ArticlePubMed