BDBM50188049 1-(2-(2-chlorophenyl)-1-phenylethyl)piperazine::CHEMBL213287::CHEMBL534942
SMILES Clc1ccccc1CC(N1CCNCC1)c1ccccc1
InChI Key InChIKey=SDLVJPBOBLQFEW-UHFFFAOYSA-N
Data  22 IC50
  Tab Delimited (TSV)   2D SDfile   Computed 3D by Vconf -m prep SDfile
Find this compound or compounds like it in BindingDB:
Activity Spreadsheet -- Enzyme Inhibition Constant Data from BindingDB
Found 22 hits for monomerid = 50188049
TargetSodium-dependent serotonin transporter(Homo sapiens (Human))
Pfizer
Curated by ChEMBL
LigandPNGBDBM50188049(1-(2-(2-chlorophenyl)-1-phenylethyl)piperazine | C...)
Affinity DataIC50:  13nM. Assay description: Inhibition of [3H]5-HT reuptake at 5HT transporter in HEK293 cells
In DepthDetails ArticlePubMed
TargetSodium-dependent dopamine transporter(Homo sapiens (Human))
Pfizer
Curated by ChEMBL
LigandPNGBDBM50188049(1-(2-(2-chlorophenyl)-1-phenylethyl)piperazine | C...)
Affinity DataIC50:  1.30E+3nM. Assay description: Inhibition of DA transporter expressed in HEK293 cells
In DepthDetails ArticlePubMed
TargetSodium-dependent serotonin transporter(Homo sapiens (Human))
Pfizer
Curated by ChEMBL
LigandPNGBDBM50188049(1-(2-(2-chlorophenyl)-1-phenylethyl)piperazine | C...)
Affinity DataIC50:  13nM. Assay description: Inhibition of [3H]5-HT reuptake at 5HT transporter in HEK293 cells
In DepthDetails ArticlePubMed
TargetSodium-dependent dopamine transporter(Homo sapiens (Human))
Pfizer
Curated by ChEMBL
LigandPNGBDBM50188049(1-(2-(2-chlorophenyl)-1-phenylethyl)piperazine | C...)
Affinity DataIC50:  1.30E+3nM. Assay description: Inhibition of [3H]DA reuptake at DA transporter in HEK293 cells
In DepthDetails ArticlePubMed
TargetSodium-dependent noradrenaline transporter(Homo sapiens (Human))
Pfizer
Curated by ChEMBL
LigandPNGBDBM50188049(1-(2-(2-chlorophenyl)-1-phenylethyl)piperazine | C...)
Affinity DataIC50:  50nM. Assay description: Inhibition of [3H]NA reuptake at NA transporter in HEK293 cells
In DepthDetails ArticlePubMed
TargetCytochrome P450 3A4(Homo sapiens (Human))
Pfizer
Curated by ChEMBL
LigandPNGBDBM50188049(1-(2-(2-chlorophenyl)-1-phenylethyl)piperazine | C...)
Affinity DataIC50: >3.00E+4nM. Assay description: Inhibition of CYP3A4
In DepthDetails ArticlePubMed
TargetCytochrome P450 2C19(Homo sapiens (Human))
Pfizer
Curated by ChEMBL
LigandPNGBDBM50188049(1-(2-(2-chlorophenyl)-1-phenylethyl)piperazine | C...)
Affinity DataIC50:  1.40E+4nM. Assay description: Inhibition of CYP2C19
In DepthDetails ArticlePubMed
TargetCytochrome P450 1A2(Homo sapiens (Human))
Pfizer
Curated by ChEMBL
LigandPNGBDBM50188049(1-(2-(2-chlorophenyl)-1-phenylethyl)piperazine | C...)
Affinity DataIC50:  2.60E+4nM. Assay description: Inhibition of CYP1A2
In DepthDetails ArticlePubMed
TargetSodium-dependent dopamine transporter(Homo sapiens (Human))
Pfizer
Curated by ChEMBL
LigandPNGBDBM50188049(1-(2-(2-chlorophenyl)-1-phenylethyl)piperazine | C...)
Affinity DataIC50:  1.60E+3nM. Assay description: Inhibition of [3H]DA reuptake at DA transporter in HEK293 cells
In DepthDetails ArticlePubMed
TargetSodium-dependent noradrenaline transporter(Homo sapiens (Human))
Pfizer
Curated by ChEMBL
LigandPNGBDBM50188049(1-(2-(2-chlorophenyl)-1-phenylethyl)piperazine | C...)
Affinity DataIC50:  22nM. Assay description: Inhibition of [3H]NA reuptake at NA transporter in HEK293 cells
In DepthDetails ArticlePubMed
TargetCytochrome P450 2C9(Homo sapiens (Human))
Pfizer
Curated by ChEMBL
LigandPNGBDBM50188049(1-(2-(2-chlorophenyl)-1-phenylethyl)piperazine | C...)
Affinity DataIC50:  2.30E+4nM. Assay description: Inhibition of CYP2C9
In DepthDetails ArticlePubMed
TargetSodium-dependent dopamine transporter(Homo sapiens (Human))
Pfizer
Curated by ChEMBL
LigandPNGBDBM50188049(1-(2-(2-chlorophenyl)-1-phenylethyl)piperazine | C...)
Affinity DataIC50:  1.60E+3nM. Assay description: Inhibition of [3H]DA reuptake at DA transporter in HEK293 cells
In DepthDetails ArticlePubMed
TargetSodium-dependent serotonin transporter(Homo sapiens (Human))
Pfizer
Curated by ChEMBL
LigandPNGBDBM50188049(1-(2-(2-chlorophenyl)-1-phenylethyl)piperazine | C...)
Affinity DataIC50:  5.40nM. Assay description: Inhibition of [3H]5-HT reuptake at 5HT transporter in HEK293 cells
In DepthDetails ArticlePubMed
TargetCytochrome P450 3A4(Homo sapiens (Human))
Pfizer
Curated by ChEMBL
LigandPNGBDBM50188049(1-(2-(2-chlorophenyl)-1-phenylethyl)piperazine | C...)
Affinity DataIC50: >3.00E+4nM. Assay description: Inhibition of CYP3A4
In DepthDetails ArticlePubMed
TargetCytochrome P450 1A2(Homo sapiens (Human))
Pfizer
Curated by ChEMBL
LigandPNGBDBM50188049(1-(2-(2-chlorophenyl)-1-phenylethyl)piperazine | C...)
Affinity DataIC50: >3.00E+4nM. Assay description: Inhibition of CYP1A2
In DepthDetails ArticlePubMed
TargetCytochrome P450 2C9(Homo sapiens (Human))
Pfizer
Curated by ChEMBL
LigandPNGBDBM50188049(1-(2-(2-chlorophenyl)-1-phenylethyl)piperazine | C...)
Affinity DataIC50:  2.30E+4nM. Assay description: Inhibition of CYP2C9
In DepthDetails ArticlePubMed
TargetCytochrome P450 2D6(Homo sapiens (Human))
Pfizer
Curated by ChEMBL
LigandPNGBDBM50188049(1-(2-(2-chlorophenyl)-1-phenylethyl)piperazine | C...)
Affinity DataIC50:  500nM. Assay description: Inhibition of CYP2D6
In DepthDetails ArticlePubMed
TargetCytochrome P450 2D6(Homo sapiens (Human))
Pfizer
Curated by ChEMBL
LigandPNGBDBM50188049(1-(2-(2-chlorophenyl)-1-phenylethyl)piperazine | C...)
Affinity DataIC50:  500nM. Assay description: Inhibition of CYP2D6
In DepthDetails ArticlePubMed
TargetCytochrome P450 2C19(Homo sapiens (Human))
Pfizer
Curated by ChEMBL
LigandPNGBDBM50188049(1-(2-(2-chlorophenyl)-1-phenylethyl)piperazine | C...)
Affinity DataIC50:  1.40E+4nM. Assay description: Inhibition of CYP2C19
In DepthDetails ArticlePubMed
TargetSodium-dependent noradrenaline transporter(Homo sapiens (Human))
Pfizer
Curated by ChEMBL
LigandPNGBDBM50188049(1-(2-(2-chlorophenyl)-1-phenylethyl)piperazine | C...)
Affinity DataIC50:  22nM. Assay description: Inhibition of [3H]NA uptake at NA transporter expressed in HEK293 cells
In DepthDetails ArticlePubMed
TargetSodium-dependent serotonin transporter(Homo sapiens (Human))
Pfizer
Curated by ChEMBL
LigandPNGBDBM50188049(1-(2-(2-chlorophenyl)-1-phenylethyl)piperazine | C...)
Affinity DataIC50:  5.40nM. Assay description: Inhibition of [3H]5-HT uptake at 5HT transporter expressed in HEK293 cells
In DepthDetails ArticlePubMed
TargetSodium-dependent noradrenaline transporter(Homo sapiens (Human))
Pfizer
Curated by ChEMBL
LigandPNGBDBM50188049(1-(2-(2-chlorophenyl)-1-phenylethyl)piperazine | C...)
Affinity DataIC50:  50nM. Assay description: Inhibition of [3H]NA reuptake at NA transporter in HEK293 cells
In DepthDetails ArticlePubMed