BDBM50195226 CHEMBL3919906
SMILES Cc1ccc(C(=O)N2CCCCCC2)c(NCc2ccco2)n1
InChI Key InChIKey=JCTPWJNVLSRFOU-UHFFFAOYSA-N
Data  2 IC50
PDB links: 1 PDB ID matches this monomer.
  Tab Delimited (TSV)   2D SDfile   Computed 3D by Vconf -m prep SDfile
Find this compound or compounds like it in BindingDB:
Activity Spreadsheet -- Enzyme Inhibition Constant Data from BindingDB
Found 2 hits for monomerid = 50195226
TargetRenin(Homo sapiens (Human))
Takeda Pharmaceutical
Curated by ChEMBL
LigandPNGBDBM50195226(CHEMBL3919906)
Affinity DataIC50:  3.80E+4nM. Assay description: Inhibition of human recombinant renin expressed in FreeStyle 293 expression system using FITC-epsilonAcp-Asp-Arg-Val-Tyr-Ile-His-Pro-Phe-His-Leu-Val-...
TargetRenin(Homo sapiens (Human))
Takeda Pharmaceutical
Curated by ChEMBL
LigandPNGBDBM50195226(CHEMBL3919906)
Affinity DataIC50:  3.80E+4nM. Assay description: Inhibition of recombinant human renin expressed in FreeStyle 293 expression system