BDBM50226 (4Z)-1-(3-fluorophenyl)-4-(2-ketoindolin-3-ylidene)pyrazolidine-3,5-quinone::(4Z)-1-(3-fluorophenyl)-4-(2-oxidanylidene-1H-indol-3-ylidene)pyrazolidine-3,5-dione::(4Z)-1-(3-fluorophenyl)-4-(2-oxo-1H-indol-3-ylidene)pyrazolidine-3,5-dione::1-(3-fluorophenyl)-4-(2-oxo-1,2-dihydro-3H-indol-3-ylidene)-3,5-pyrazolidinedione::MLS000580068::SMR000199312::cid_5428579
SMILES Fc1cccc(c1)N1NC(=O)\C(C1=O)=C1\C(=O)Nc2ccccc12
InChI Key InChIKey=CDNIIUJDSUXPEZ-YPKPFQOOSA-N
Data  1 IC50
  Tab Delimited (TSV)   2D SDfile   Computed 3D by Vconf -m prep SDfile
Find this compound or compounds like it in BindingDB:
Activity Spreadsheet -- Enzyme Inhibition Constant Data from BindingDB
Found 1 hit for monomerid = 50226
TargetInduced myeloid leukemia cell differentiation protein Mcl-1(Homo sapiens (Human))
Emory University
Curated by PubChem BioAssay
LigandPNGBDBM50226((4Z)-1-(3-fluorophenyl)-4-(2-ketoindolin-3-ylidene...)
Affinity DataIC50:  400nM. Assay description: NIH Molecular Libraries Screening Centers Network [MLSCN] Emory Chemical Biology Discovery Center in MLSCN Assay provider: Nikolovska-Coleska, Univer...
In DepthDetails PCBioAssay