BDBM50241596 CHEMBL4087267
SMILES COc1ccc(cc1OC)-c1ccc2nnc(C)n2n1
InChI Key InChIKey=SBNMXRKZAVLTHG-UHFFFAOYSA-N
Data  1 IC50
PDB links: 1 PDB ID matches this monomer.
  Tab Delimited (TSV)   2D SDfile   Computed 3D by Vconf -m prep SDfile
Find this compound or compounds like it in BindingDB:
Activity Spreadsheet -- Enzyme Inhibition Constant Data from BindingDB
Found 1 hit for monomerid = 50241596
TargetBromodomain-containing protein 4(Homo sapiens (Human))
University Of Vienna
Curated by ChEMBL
LigandPNGBDBM50241596(CHEMBL4087267)
Affinity DataIC50:  2.40E+4nM. Assay description: Inhibition of recombinant human N-terminal His6-tagged Brd4-BD1 expressed in Escherichia coli BL21(DE3) by LOGSY NMR titration method