BDBM50242817 CHEMBL4087968
SMILES Nc1ccc(F)cc1NC(=O)c1ccc(CNC(=O)\C=C\c2cccnc2)cc1
InChI Key InChIKey=WXHHICFWKXDFOW-BJMVGYQFSA-N
Data  40 IC50
  Tab Delimited (TSV)   2D SDfile   Computed 3D by Vconf -m prep SDfile
Find this compound or compounds like it in BindingDB:
Activity Spreadsheet -- Enzyme Inhibition Constant Data from BindingDB
Found 40 hits for monomerid = 50242817
TargetHistone deacetylase 1(Homo sapiens (Human))
Shanghai Institute Of Pharmaceutical Industry
Curated by ChEMBL
LigandPNGBDBM50242817(CHEMBL4087968)
Affinity DataIC50:  2.70E+3nM. Assay description: Inhibition of recombinant human HDAC1 expressed in Baculovirus insect cell expression system using [3H]-metabolically labeled acetylated histone subs...
In DepthDetails ArticlePubMed
TargetHistone deacetylase 11(Homo sapiens (Human))TBA
LigandPNGBDBM50242817(CHEMBL4087968)
Affinity DataIC50:  432nM. Assay description: Inhibition of 5-HT binding to 5-HT2B receptor of Rat stomach fundus
In DepthDetails PubMed
TargetHistone deacetylase 1(Homo sapiens (Human))
Shanghai Institute Of Pharmaceutical Industry
Curated by ChEMBL
LigandPNGBDBM50242817(CHEMBL4087968)
Affinity DataIC50:  864nM. Assay description: Ability to displace [3H]quipazine binding to 5-hydroxytryptamine 3 receptor sites in NG 108-15.
In DepthDetails ArticlePubMed
TargetHistone deacetylase 1(Homo sapiens (Human))
Shanghai Institute Of Pharmaceutical Industry
Curated by ChEMBL
LigandPNGBDBM50242817(CHEMBL4087968)
Affinity DataIC50:  540nM. Assay description: Inhibition of human recombinant HDAC1 using Fluor de Lys-Green as substrate preincubated for 5 mins followed by substrate addition and measured after...
In DepthDetails ArticlePubMed
TargetHistone deacetylase 6(Homo sapiens (Human))
Beijing University Of Chemical Technology
Curated by ChEMBL
LigandPNGBDBM50242817(CHEMBL4087968)
Affinity DataIC50:  7.11E+3nM. Assay description: Inhibition of human recombinant HDAC6 using Fluor de Lys-Green as substrate preincubated for 5 mins followed by substrate addition and measured after...
In DepthDetails ArticlePubMed
TargetHistone deacetylase(Homo sapiens (Human))
Beijing University Of Chemical Technology
Curated by ChEMBL
LigandPNGBDBM50242817(CHEMBL4087968)
Affinity DataIC50:  1.38E+3nM. Assay description: Inhibition of HDAC in human HeLa cell extract using Fluor de Lys-Green as substrate preincubated for 5 mins followed by substrate addition and measur...
In DepthDetails ArticlePubMed
TargetHistone deacetylase 2(Homo sapiens (Human))
Beijing University Of Chemical Technology
Curated by ChEMBL
LigandPNGBDBM50242817(CHEMBL4087968)
Affinity DataIC50:  370nM. Assay description: Inhibition of human recombinant HDAC2 using Fluor de Lys-Green as substrate preincubated for 5 mins followed by substrate addition and measured after...
In DepthDetails ArticlePubMed
TargetHistone deacetylase(Homo sapiens (Human))
Beijing University Of Chemical Technology
Curated by ChEMBL
LigandPNGBDBM50242817(CHEMBL4087968)
Affinity DataIC50:  900nM. Assay description: Inhibition of HDAC in human HeLa cell nuclear extract using fluor-de-lys-green as substrate preincubated for 10 mins followed by substrate addition a...
In DepthDetails ArticlePubMed
TargetHistone deacetylase 1(Homo sapiens (Human))
Shanghai Institute Of Pharmaceutical Industry
Curated by ChEMBL
LigandPNGBDBM50242817(CHEMBL4087968)
Affinity DataIC50:  190nM. Assay description: Inhibition of human recombinant His-tagged HDAC1 (482 residues) expressed in baculovirus infected insect cells using FLUOR DE LYS SIRT1 as substrate ...
In DepthDetails ArticlePubMed
TargetHistone deacetylase 2(Homo sapiens (Human))
Beijing University Of Chemical Technology
Curated by ChEMBL
LigandPNGBDBM50242817(CHEMBL4087968)
Affinity DataIC50:  310nM. Assay description: Inhibition of human recombinant His-tagged HDAC2 (1 to 582 residues) expressed in baculovirus infected insect cells using FLUOR DE LYS Green as subst...
In DepthDetails ArticlePubMed
TargetHistone deacetylase 6(Homo sapiens (Human))
Beijing University Of Chemical Technology
Curated by ChEMBL
LigandPNGBDBM50242817(CHEMBL4087968)
Affinity DataIC50:  7.23E+3nM. Assay description: Inhibition of human recombinant His-tagged HDAC6 expressed in baculovirus infected insect cells using FLUOR DE LYS SIRT1 as substrate preincubated fo...
In DepthDetails ArticlePubMed
TargetHistone deacetylase 2(Homo sapiens (Human))
Beijing University Of Chemical Technology
Curated by ChEMBL
LigandPNGBDBM50242817(CHEMBL4087968)
Affinity DataIC50:  160nM. Assay description: Inhibition of HDAC2 (unknown origin)
In DepthDetails ArticlePubMed
TargetHistone deacetylase 1(Homo sapiens (Human))
Shanghai Institute Of Pharmaceutical Industry
Curated by ChEMBL
LigandPNGBDBM50242817(CHEMBL4087968)
Affinity DataIC50:  95nM. Assay description: Inhibition of HDAC1 (unknown origin)
In DepthDetails ArticlePubMed
TargetHistone deacetylase 3(Homo sapiens (Human))
Hunan University Of Science And Technology
Curated by ChEMBL
LigandPNGBDBM50242817(CHEMBL4087968)
Affinity DataIC50:  67nM. Assay description: Inhibition of HDAC3 (unknown origin)
In DepthDetails ArticlePubMed
TargetPolyamine deacetylase HDAC10(Homo sapiens (Human))
Hunan University Of Science And Technology
Curated by ChEMBL
LigandPNGBDBM50242817(CHEMBL4087968)
Affinity DataIC50:  78nM. Assay description: Inhibition of HDAC10 (unknown origin)
In DepthDetails ArticlePubMed
TargetHistone deacetylase 1(Homo sapiens (Human))
Shanghai Institute Of Pharmaceutical Industry
Curated by ChEMBL
LigandPNGBDBM50242817(CHEMBL4087968)
Affinity DataIC50:  190nM. Assay description: Inhibition of recombinant human His tagged HDAC1 expressed in baculovirus infected insect cells assessed as decrease in deacetylation of FLUOR DE LYS...
In DepthDetails ArticlePubMed
TargetHistone deacetylase 2(Homo sapiens (Human))
Beijing University Of Chemical Technology
Curated by ChEMBL
LigandPNGBDBM50242817(CHEMBL4087968)
Affinity DataIC50:  310nM. Assay description: Inhibition of recombinant human HDAC2 assessed as decrease in deacetylation of FLUOR DE LYS Green substrate preincubated for 10 mins followed by subs...
In DepthDetails ArticlePubMed
TargetNuclear receptor corepressor 1(Homo sapiens (Human))
Beijing University Of Chemical Technology
Curated by ChEMBL
LigandPNGBDBM50242817(CHEMBL4087968)
Affinity DataIC50:  234nM. Assay description: Inhibition of recombinant human HDAC3/NCOR1 assessed as decrease in deacetylation of FLUOR DE LYS SIRT1 substrate preincubated for 10 mins followed b...
In DepthDetails ArticlePubMed
TargetHistone deacetylase 6(Homo sapiens (Human))
Beijing University Of Chemical Technology
Curated by ChEMBL
LigandPNGBDBM50242817(CHEMBL4087968)
Affinity DataIC50:  7.23E+3nM. Assay description: Inhibition of recombinant human His tagged HDAC6 expressed in baculovirus infected insect cells assessed as decrease in deacetylation of FLUOR DE LYS...
In DepthDetails ArticlePubMed
TargetHistone deacetylase 8(Homo sapiens (Human))
Beijing University Of Chemical Technology
Curated by ChEMBL
LigandPNGBDBM50242817(CHEMBL4087968)
Affinity DataIC50: >3.20E+4nM. Assay description: Inhibition of recombinant human HDAC8 assessed as decrease in deacetylation of FLUOR DE LYS substrate preincubated for 10 mins followed by substrate ...
In DepthDetails ArticlePubMed
TargetHistone deacetylase(Homo sapiens (Human))
Beijing University Of Chemical Technology
Curated by ChEMBL
LigandPNGBDBM50242817(CHEMBL4087968)
Affinity DataIC50:  900nM. Assay description: Inhibition of HDAC in human HeLa cell nuclear extract assessed as decrease in deacetylation of FLUOR DE LYS Green substrate preincubated for 10 mins ...
In DepthDetails ArticlePubMed
TargetHistone deacetylase 1(Homo sapiens (Human))
Shanghai Institute Of Pharmaceutical Industry
Curated by ChEMBL
LigandPNGBDBM50242817(CHEMBL4087968)
Affinity DataIC50:  160nM. Assay description: Inhibition of HDAC1 (unknown origin)
In DepthDetails ArticlePubMed
TargetHistone deacetylase 1(Homo sapiens (Human))
Shanghai Institute Of Pharmaceutical Industry
Curated by ChEMBL
LigandPNGBDBM50242817(CHEMBL4087968)
Affinity DataIC50:  260nM. Assay description: Inhibition of recombinant human HDAC1 using SIRT1 as substrate incubated for 10 mins followed by substrate addition and measured after 30 mins by flu...
In DepthDetails ArticlePubMed
TargetHistone deacetylase 2(Homo sapiens (Human))
Beijing University Of Chemical Technology
Curated by ChEMBL
LigandPNGBDBM50242817(CHEMBL4087968)
Affinity DataIC50:  67nM. Assay description: Inhibition of recombinant human HDAC2 using FLUOR-DE-LYS-Green as substrate incubated for 10 mins followed by substrate addition and measured after 3...
In DepthDetails ArticlePubMed
TargetHistone deacetylase 1(Homo sapiens (Human))
Shanghai Institute Of Pharmaceutical Industry
Curated by ChEMBL
LigandPNGBDBM50242817(CHEMBL4087968)
Affinity DataIC50:  2.60E+5nM. Assay description: Inhibition of human recombinant HDAC1 preincubated for 10 mins followed by addition of substrate fluor De Lys SIRT1 deacetylase measured after 30 min...
In DepthDetails ArticlePubMed
TargetHistone deacetylase 2(Homo sapiens (Human))
Beijing University Of Chemical Technology
Curated by ChEMBL
LigandPNGBDBM50242817(CHEMBL4087968)
Affinity DataIC50:  2.30E+4nM. Assay description: Inhibition of human recombinant HDAC2 preincubated for 10 mins followed by addition of substrate fluor De Lys green measured after 30 mins by fluores...
In DepthDetails ArticlePubMed
TargetNuclear receptor corepressor 1(Homo sapiens (Human))
Beijing University Of Chemical Technology
Curated by ChEMBL
LigandPNGBDBM50242817(CHEMBL4087968)
Affinity DataIC50:  1.80E+5nM. Assay description: Inhibition of human recombinant HDAC3/NCOR1 complex preincubated for 10 mins followed by addition of substrate fluor De Lys SIRT1 deacetylase measure...
In DepthDetails ArticlePubMed
TargetHistone deacetylase 6(Homo sapiens (Human))
Beijing University Of Chemical Technology
Curated by ChEMBL
LigandPNGBDBM50242817(CHEMBL4087968)
Affinity DataIC50: >1.00E+6nM. Assay description: Inhibition of human recombinant HDAC6 preincubated for 10 mins followed by addition of substrate fluor De Lys SIRT1 deacetylase measured after 30 min...
In DepthDetails ArticlePubMed
TargetHistone deacetylase 8(Homo sapiens (Human))
Beijing University Of Chemical Technology
Curated by ChEMBL
LigandPNGBDBM50242817(CHEMBL4087968)
Affinity DataIC50: >1.00E+6nM. Assay description: Inhibition of human recombinant HDAC8 preincubated for 10 mins followed by substrate addition measured after 30 mins by fluorescent plate reader anal...
In DepthDetails ArticlePubMed
TargetHistone deacetylase 1(Homo sapiens (Human))
Shanghai Institute Of Pharmaceutical Industry
Curated by ChEMBL
LigandPNGBDBM50242817(CHEMBL4087968)
Affinity DataIC50:  95nM. Assay description: PGE-2 (EP1 subtype) antagonistic activity as PGE2-stimulated guinea pig ileum muscle strip assay
In DepthDetails PubMed
TargetHistone deacetylase 2(Homo sapiens (Human))
Beijing University Of Chemical Technology
Curated by ChEMBL
LigandPNGBDBM50242817(CHEMBL4087968)
Affinity DataIC50:  160nM. Assay description: PGE-2 (EP1 subtype) antagonistic activity as PGE2-stimulated guinea pig ileum muscle strip assay
In DepthDetails PubMed
TargetHistone deacetylase 3(Homo sapiens (Human))
Hunan University Of Science And Technology
Curated by ChEMBL
LigandPNGBDBM50242817(CHEMBL4087968)
Affinity DataIC50:  67nM. Assay description: PGE-2 (EP1 subtype) antagonistic activity as PGE2-stimulated guinea pig ileum muscle strip assay
In DepthDetails PubMed
TargetHistone deacetylase 4(Homo sapiens (Human))TBA
LigandPNGBDBM50242817(CHEMBL4087968)
Affinity DataIC50: >3.00E+4nM. Assay description: PGE-2 (EP1 subtype) antagonistic activity as PGE2-stimulated guinea pig ileum muscle strip assay
In DepthDetails PubMed
TargetHistone deacetylase 5(Homo sapiens (Human))TBA
LigandPNGBDBM50242817(CHEMBL4087968)
Affinity DataIC50: >3.00E+4nM. Assay description: PGE-2 (EP1 subtype) antagonistic activity as PGE2-stimulated guinea pig ileum muscle strip assay
In DepthDetails PubMed
TargetHistone deacetylase 6(Homo sapiens (Human))
Beijing University Of Chemical Technology
Curated by ChEMBL
LigandPNGBDBM50242817(CHEMBL4087968)
Affinity DataIC50: >3.00E+4nM. Assay description: PGE-2 (EP1 subtype) antagonistic activity as PGE2-stimulated guinea pig ileum muscle strip assay
In DepthDetails PubMed
TargetHistone deacetylase 7(Homo sapiens (Human))TBA
LigandPNGBDBM50242817(CHEMBL4087968)
Affinity DataIC50: >3.00E+4nM. Assay description: Inhibition of 5-HT binding to 5-HT2B receptor of Rat stomach fundus
In DepthDetails PubMed
TargetHistone deacetylase 8(Homo sapiens (Human))
Beijing University Of Chemical Technology
Curated by ChEMBL
LigandPNGBDBM50242817(CHEMBL4087968)
Affinity DataIC50:  733nM. Assay description: Inhibition of 5-HT binding to 5-HT2B receptor of Rat stomach fundus
In DepthDetails PubMed
TargetHistone deacetylase 9(Homo sapiens (Human))TBA
LigandPNGBDBM50242817(CHEMBL4087968)
Affinity DataIC50: >3.00E+4nM. Assay description: Inhibition of 5-HT binding to 5-HT2B receptor of Rat stomach fundus
In DepthDetails PubMed
TargetPolyamine deacetylase HDAC10(Homo sapiens (Human))
Hunan University Of Science And Technology
Curated by ChEMBL
LigandPNGBDBM50242817(CHEMBL4087968)
Affinity DataIC50:  78nM. Assay description: Inhibition of 5-HT binding to 5-HT2B receptor of Rat stomach fundus
In DepthDetails PubMed
TargetPotassium voltage-gated channel subfamily H member 2(Homo sapiens (Human))
Shanghai Institute Of Pharmaceutical Industry
Curated by ChEMBL
LigandPNGBDBM50242817(CHEMBL4087968)
Affinity DataIC50:  3.20E+4nM. Assay description: Inhibition of purified HIV-1 reverse transcriptase
In DepthDetails ArticlePubMed