BDBM50244635 CHEMBL4085190
SMILES NS(=O)(=O)c1c(F)c(F)c(c(NCc2ccccc2)c1F)S(=O)(=O)CCO
InChI Key InChIKey=OLTMJLATLWYQJF-UHFFFAOYSA-N
Data  4 Kd  4 Koff
PDB links: 7 PDB IDs match this monomer.
  Tab Delimited (TSV)   2D SDfile   Computed 3D by Vconf -m prep SDfile
Find this compound or compounds like it in BindingDB:
Activity Spreadsheet -- Enzyme Inhibition Constant Data from BindingDB
Found 8 hits for monomerid = 50244635
TargetCarbonic anhydrase 13(Homo sapiens (Human))
Vilnius University
Curated by ChEMBL
LigandPNGBDBM50244635(CHEMBL4085190)
Affinity DataKd:  12nM. Assay description: Binding affinity to human N-terminal full length His-tagged CA13 (1 to 262 residues) expressed in Escherichia coli BL21(DE3) assessed as thermodynami...
TargetCarbonic anhydrase 13(Homo sapiens (Human))
Vilnius University
Curated by ChEMBL
LigandPNGBDBM50244635(CHEMBL4085190)
Affinity DataKd:  1nM. Assay description: Binding affinity to human N-terminal full length His-tagged CA13 (1 to 262 residues) expressed in Escherichia coli BL21(DE3) assessed as intrinsic th...
TargetCarbonic anhydrase 13(Homo sapiens (Human))
Vilnius University
Curated by ChEMBL
LigandPNGBDBM50244635(CHEMBL4085190)
Affinity DataKon:  0.0150M-1s-1Assay Description:Binding affinity to human N-terminal full length His-tagged CA13 (1 to 262 residues) expressed in Escherichia coli BL21(DE3) assessed as dissociation...
TargetCarbonic anhydrase 2(Homo sapiens (Human))
Vilnius University
Curated by ChEMBL
LigandPNGBDBM50244635(CHEMBL4085190)
Affinity DataKon:  0.0440M-1s-1Assay Description:Binding affinity to human full length His-tagged CA2 (1 to 260 residues) expressed in Escherichia coli BL21(DE3) assessed as intrinsic dissociation r...
TargetCarbonic anhydrase 2(Homo sapiens (Human))
Vilnius University
Curated by ChEMBL
LigandPNGBDBM50244635(CHEMBL4085190)
Affinity DataKd:  2nM. Assay description: Binding affinity to human full length His-tagged CA2 (1 to 260 residues) expressed in Escherichia coli BL21(DE3) assessed as intrinsic thermodynamic ...
TargetCarbonic anhydrase 2(Homo sapiens (Human))
Vilnius University
Curated by ChEMBL
LigandPNGBDBM50244635(CHEMBL4085190)
Affinity DataKon:  0.0500M-1s-1Assay Description:Binding affinity to human full length His-tagged CA2 (1 to 260 residues) expressed in Escherichia coli BL21(DE3) assessed as dissociation rate consta...
TargetCarbonic anhydrase 13(Homo sapiens (Human))
Vilnius University
Curated by ChEMBL
LigandPNGBDBM50244635(CHEMBL4085190)
Affinity DataKon:  0.0130M-1s-1Assay Description:Binding affinity to human N-terminal full length His-tagged CA13 (1 to 262 residues) expressed in Escherichia coli BL21(DE3) assessed as intrinsic di...
TargetCarbonic anhydrase 2(Homo sapiens (Human))
Vilnius University
Curated by ChEMBL
LigandPNGBDBM50244635(CHEMBL4085190)
Affinity DataKd:  61nM. Assay description: Binding affinity to human full length His-tagged CA2 (1 to 260 residues) expressed in Escherichia coli BL21(DE3) assessed as thermodynamic equilibriu...