BDBM50250110 CHEMBL4065757
SMILES Oc1cc(nc2nnnn12)-c1ccccc1
InChI Key InChIKey=ZEMGYOQXYFNSGE-UHFFFAOYSA-N
Data  1 IC50  2 Kd
PDB links: 1 PDB ID matches this monomer.
  Tab Delimited (TSV)   2D SDfile   Computed 3D by Vconf -m prep SDfile
Find this compound or compounds like it in BindingDB:
Activity Spreadsheet -- Enzyme Inhibition Constant Data from BindingDB
Found 3 hits for monomerid = 50250110
TargetCyclic GMP-AMP synthase(Homo sapiens)
Pfizer
Curated by ChEMBL
LigandPNGBDBM50250110(CHEMBL4065757)
Affinity DataIC50:  7.80E+4nM. Assay description: Inhibition of human cGAS (2 to 522 residues) expressed in Sf9 insect cells assessed as reduction in cGAMP level using ISD DNA as substrate in presenc...
TargetCyclic GMP-AMP synthase(Homo sapiens)
Pfizer
Curated by ChEMBL
LigandPNGBDBM50250110(CHEMBL4065757)
Affinity DataKd:  1.70E+5nM. Assay description: Binding affinity to human Cyclic GMP-AMP synthase (2 to 522 residues) expressed in Sf9 cells by surface plasmon resonance analysis
TargetCyclic GMP-AMP synthase(Homo sapiens)
Pfizer
Curated by ChEMBL
LigandPNGBDBM50250110(CHEMBL4065757)
Affinity DataKd:  1.71E+5nM. Assay description: Inhibition of human cGAS (2 to 522 residues) expressed in Sf9 insect cells assessed as reduction in cGAMP level using ISD DNA as substrate in presenc...