BDBM50271175 CHEMBL4126365
SMILES [H][C@@]12CCC[C@@]1(NC(=N)N(C)S2(=O)=O)c1cc(NC(=O)c2ncc(F)cc2F)ccc1F
InChI Key InChIKey=NWDPGGJFZUSNSI-DNVCBOLYSA-N
Data  4 KI
  Tab Delimited (TSV)   2D SDfile   Computed 3D by Vconf -m prep SDfile
Find this compound or compounds like it in BindingDB:
Activity Spreadsheet -- Enzyme Inhibition Constant Data from BindingDB
Found 4 hits for monomerid = 50271175
TargetBeta-secretase 2(Homo sapiens (Human))
TBA
US Patent
LigandPNGBDBM50271175(CHEMBL4126365)
Affinity DataKi:  1nM. Assay description: The compounds of the invention were assessed for their ability to inhibit BACE-1 using the following assay. The resulting values are reported in the ...
In DepthDetails US Patent
TargetBeta-secretase 2(Homo sapiens (Human))
TBA
US Patent
LigandPNGBDBM50271175(CHEMBL4126365)
Affinity DataKi:  1nM. Assay description: Binding affinity to human autoBACE2 using QSY7-APPswe-Eu as substrate preincubated for 30 mins followed by substrate addition measured after 90 mins ...
In DepthDetails ArticlePubMed
TargetBeta-secretase 1(Homo sapiens (Human))
Temple University School Of Pharmacy
Curated by ChEMBL
LigandPNGBDBM50271175(CHEMBL4126365)
Affinity DataKi:  22nM. Assay description: Binding affinity to human BACE1 catalytic domain using QSY7-APPswe-Eu as substrate preincubated for 30 mins followed by substrate addition measured a...
In DepthDetails ArticlePubMed
TargetBeta-secretase 1(Homo sapiens (Human))
Temple University School Of Pharmacy
Curated by ChEMBL
LigandPNGBDBM50271175(CHEMBL4126365)
Affinity DataKi:  22nM. Assay description: The compounds of the invention were assessed for their ability to inhibit BACE-1 using the following assay. The resulting values are reported in the ...
In DepthDetails US Patent