BDBM50271273 CHEMBL4127125
SMILES CC(=O)N[C@@H]1[C@@H](O)[C@@H](F)[C@@](F)(O[C@H]1C[C@H](O)CO)C(O)=O
InChI Key InChIKey=NDXUMNONGSWWQV-QYKRXNJRSA-N
Data  22 IC50
PDB links: 1 PDB ID matches this monomer.
  Tab Delimited (TSV)   2D SDfile   Computed 3D by Vconf -m prep SDfile
Find this compound or compounds like it in BindingDB:
Activity Spreadsheet -- Enzyme Inhibition Constant Data from BindingDB
Found 22 hits for monomerid = 50271273
TargetNeuraminidase(Influenza A virus)
Csiro Manufacturing
Curated by ChEMBL
LigandPNGBDBM50271273(CHEMBL4127125)
Affinity DataIC50:  418nM. Assay description: Inhibition of Influenza A virus (A/swine/Shepparton/6/2009 (H1N1)) neuraminidase activity using 4-MUNANA as substrate measured every min for 60 mins ...
In DepthDetails ArticlePubMed
TargetNeuraminidase(Influenza A virus)
Csiro Manufacturing
Curated by ChEMBL
LigandPNGBDBM50271273(CHEMBL4127125)
Affinity DataIC50:  330nM. Assay description: Inhibition of Influenza A virus (A/California/07/09 (H1N1)) neuraminidase activity using 4-MUNANA as substrate preincubated for 60 mins followed by s...
In DepthDetails ArticlePubMed
TargetNeuraminidase(Influenza B virus)
Csiro Manufacturing
Curated by ChEMBL
LigandPNGBDBM50271273(CHEMBL4127125)
Affinity DataIC50:  228nM. Assay description: Inhibition of Influenza B virus (B/Perth/211/2001) neuraminidase activity using 4-MUNANA as substrate measured every min for 60 mins by fluorescence ...
In DepthDetails ArticlePubMed
TargetNeuraminidase(Influenza B virus)
Csiro Manufacturing
Curated by ChEMBL
LigandPNGBDBM50271273(CHEMBL4127125)
Affinity DataIC50:  40nM. Assay description: Inhibition of Influenza B virus (B/Perth/211/2001) neuraminidase activity using 4-MUNANA as substrate preincubated for 60 mins followed by substrate ...
In DepthDetails ArticlePubMed
TargetNeuraminidase(Influenza B virus (B/Lee/40))
Csiro Manufacturing
Curated by ChEMBL
LigandPNGBDBM50271273(CHEMBL4127125)
Affinity DataIC50:  1.55E+3nM. Assay description: Inhibition of Influenza B virus (B/Perth/211/2001) neuraminidase D197E mutant activity using 4-MUNANA as substrate measured every min for 60 mins by ...
In DepthDetails ArticlePubMed
TargetNeuraminidase(Influenza A virus (A/Brisbane/59/2007(H1N1)))
Csiro Manufacturing
Curated by ChEMBL
LigandPNGBDBM50271273(CHEMBL4127125)
Affinity DataIC50:  191nM. Assay description: Inhibition of Influenza A virus (A/Fukui/45/04(H3N2)) neuraminidase E119V mutant activity using 4-MUNANA as substrate measured every min for 60 mins ...
In DepthDetails ArticlePubMed
TargetNeuraminidase(Influenza A virus (A/Brisbane/59/2007(H1N1)))
Csiro Manufacturing
Curated by ChEMBL
LigandPNGBDBM50271273(CHEMBL4127125)
Affinity DataIC50:  102nM. Assay description: Inhibition of Influenza A virus (A/Fukui/45/04(H3N2)) neuraminidase E119V mutant activity using 4-MUNANA as substrate preincubated for 60 mins follow...
In DepthDetails ArticlePubMed
TargetNeuraminidase(Influenza A virus)
Csiro Manufacturing
Curated by ChEMBL
LigandPNGBDBM50271273(CHEMBL4127125)
Affinity DataIC50:  985nM. Assay description: Inhibition of Influenza A virus (A/NWS/G70C(H1N9)) neuraminidase E119G mutant activity using 4-MUNANA as substrate measured every min for 60 mins by ...
In DepthDetails ArticlePubMed
TargetNeuraminidase(Influenza A virus)
Csiro Manufacturing
Curated by ChEMBL
LigandPNGBDBM50271273(CHEMBL4127125)
Affinity DataIC50:  874nM. Assay description: Inhibition of Influenza A virus (A/NWS/G70C(H1N9)) neuraminidase E119G mutant activity using 4-MUNANA as substrate preincubated for 60 mins followed ...
In DepthDetails ArticlePubMed
TargetNeuraminidase(Influenza A virus)
Csiro Manufacturing
Curated by ChEMBL
LigandPNGBDBM50271273(CHEMBL4127125)
Affinity DataIC50:  61nM. Assay description: Inhibition of Influenza A virus (A/Mississippi/03/01 (H1N1)) neuraminidase activity using 4-MUNANA as substrate measured every min for 60 mins by flu...
In DepthDetails ArticlePubMed
TargetNeuraminidase(Influenza A virus)
Csiro Manufacturing
Curated by ChEMBL
LigandPNGBDBM50271273(CHEMBL4127125)
Affinity DataIC50:  37nM. Assay description: Inhibition of Influenza A virus (A/Mississippi/03/01 (H1N1)) neuraminidase activity using 4-MUNANA as substrate preincubated for 60 mins followed by ...
In DepthDetails ArticlePubMed
TargetNeuraminidase(Influenza A virus)
Csiro Manufacturing
Curated by ChEMBL
LigandPNGBDBM50271273(CHEMBL4127125)
Affinity DataIC50:  460nM. Assay description: Inhibition of Influenza A virus (A/chicken/Vietnam/08/2004 (H5N1)) clade 1 neuraminidase activity using 4-MUNANA as substrate measured every min for ...
In DepthDetails ArticlePubMed
TargetNeuraminidase(Influenza A virus)
Csiro Manufacturing
Curated by ChEMBL
LigandPNGBDBM50271273(CHEMBL4127125)
Affinity DataIC50:  281nM. Assay description: Inhibition of Influenza A virus (A/chicken/Bangli/BBVD-563/2007(H5N1)) clade 2 neuraminidase activity using 4-MUNANA as substrate measured every min ...
In DepthDetails ArticlePubMed
TargetNeuraminidase(Influenza A virus)
Csiro Manufacturing
Curated by ChEMBL
LigandPNGBDBM50271273(CHEMBL4127125)
Affinity DataIC50:  98nM. Assay description: Inhibition of Influenza A virus (A/Mississippi/03/01 (H1N1)) neuraminidase H274Y mutant using 4-MUNANA as substrate measured every min for 60 mins by...
In DepthDetails ArticlePubMed
TargetNeuraminidase(Influenza A virus)
Csiro Manufacturing
Curated by ChEMBL
LigandPNGBDBM50271273(CHEMBL4127125)
Affinity DataIC50:  710nM. Assay description: Inhibition of Influenza A virus (A/chicken/Vietnam/08/2004 (H5N1)) clade 1 neuraminidase activity using 4-MUNANA as substrate preincubated for 60 min...
In DepthDetails ArticlePubMed
TargetNeuraminidase(Influenza B virus (B/Lee/40))
Csiro Manufacturing
Curated by ChEMBL
LigandPNGBDBM50271273(CHEMBL4127125)
Affinity DataIC50:  212nM. Assay description: Inhibition of Influenza B virus (B/Perth/211/2001) neuraminidase D197E mutant activity using 4-MUNANA as substrate preincubated for 60 mins followed ...
In DepthDetails ArticlePubMed
TargetNeuraminidase(Influenza A virus)
Csiro Manufacturing
Curated by ChEMBL
LigandPNGBDBM50271273(CHEMBL4127125)
Affinity DataIC50:  104nM. Assay description: Inhibition of Influenza A virus (A/Mississippi/03/01 (H1N1)) neuraminidase H274Y mutant using 4-MUNANA as substrate preincubated for 60 mins followed...
In DepthDetails ArticlePubMed
TargetNeuraminidase(Influenza A virus)
Csiro Manufacturing
Curated by ChEMBL
LigandPNGBDBM50271273(CHEMBL4127125)
Affinity DataIC50:  316nM. Assay description: Inhibition of Influenza A virus (A/chicken/Bangli/BBVD-563/2007(H5N1)) clade 2 neuraminidase activity using 4-MUNANA as substrate preincubated for 60...
In DepthDetails ArticlePubMed
TargetNeuraminidase(Influenza A virus (strain A/Memphis/1/1971 H3N2))
Csiro Manufacturing
Curated by ChEMBL
LigandPNGBDBM50271273(CHEMBL4127125)
Affinity DataIC50:  472nM. Assay description: Inhibition of Influenza A virus (A/Fukui/45/04(H3N2)) neuraminidase activity using 4-MUNANA as substrate measured every min for 60 mins by fluorescen...
In DepthDetails ArticlePubMed
TargetNeuraminidase(Influenza A virus (strain A/Memphis/1/1971 H3N2))
Csiro Manufacturing
Curated by ChEMBL
LigandPNGBDBM50271273(CHEMBL4127125)
Affinity DataIC50:  345nM. Assay description: Inhibition of Influenza A virus (A/Fukui/45/04(H3N2)) neuraminidase activity using 4-MUNANA as substrate preincubated for 60 mins followed by substra...
In DepthDetails ArticlePubMed
TargetNeuraminidase(Influenza A virus)
Csiro Manufacturing
Curated by ChEMBL
LigandPNGBDBM50271273(CHEMBL4127125)
Affinity DataIC50:  457nM. Assay description: Inhibition of Influenza A virus (A/California/07/09 (H1N1)) neuraminidase activity using 4-MUNANA as substrate measured every min for 60 mins by fluo...
In DepthDetails ArticlePubMed
TargetNeuraminidase(Influenza A virus)
Csiro Manufacturing
Curated by ChEMBL
LigandPNGBDBM50271273(CHEMBL4127125)
Affinity DataIC50:  316nM. Assay description: Inhibition of Influenza A virus (A/swine/Shepparton/6/2009 (H1N1)) neuraminidase activity using 4-MUNANA as substrate preincubated for 60 mins follow...
In DepthDetails ArticlePubMed