BDBM50271298 CHEMBL4128362
SMILES [H][C@]1(O[C@](F)([C@H](F)[C@H](O)[C@H]1NC(C)=O)C(O)=O)[C@H](O)[C@H](O)CO
InChI Key InChIKey=HMALKZAXODOYOP-DAXAGCIGSA-N
Data  22 IC50
PDB links: 4 PDB IDs match this monomer.
  Tab Delimited (TSV)   2D SDfile   Computed 3D by Vconf -m prep SDfile
Find this compound or compounds like it in BindingDB:
Activity Spreadsheet -- Enzyme Inhibition Constant Data from BindingDB
Found 22 hits for monomerid = 50271298
TargetNeuraminidase(Influenza A virus)
Csiro Manufacturing
Curated by ChEMBL
LigandPNGBDBM50271298(CHEMBL4128362)
Affinity DataIC50:  470nM. Assay description: Inhibition of Influenza A virus (A/swine/Shepparton/6/2009 (H1N1)) neuraminidase activity using 4-MUNANA as substrate preincubated for 60 mins follow...
In DepthDetails ArticlePubMed
TargetNeuraminidase(Influenza A virus)
Csiro Manufacturing
Curated by ChEMBL
LigandPNGBDBM50271298(CHEMBL4128362)
Affinity DataIC50:  791nM. Assay description: Inhibition of Influenza A virus (A/swine/Shepparton/6/2009 (H1N1)) neuraminidase activity using 4-MUNANA as substrate measured every min for 60 mins ...
In DepthDetails ArticlePubMed
TargetNeuraminidase(Influenza A virus)
Csiro Manufacturing
Curated by ChEMBL
LigandPNGBDBM50271298(CHEMBL4128362)
Affinity DataIC50:  116nM. Assay description: Inhibition of Influenza A virus (A/Mississippi/03/01 (H1N1)) neuraminidase activity using 4-MUNANA as substrate measured every min for 60 mins by flu...
In DepthDetails ArticlePubMed
TargetNeuraminidase(Influenza B virus)
Csiro Manufacturing
Curated by ChEMBL
LigandPNGBDBM50271298(CHEMBL4128362)
Affinity DataIC50:  414nM. Assay description: Inhibition of Influenza B virus (B/Perth/211/2001) neuraminidase activity using 4-MUNANA as substrate measured every min for 60 mins by fluorescence ...
In DepthDetails ArticlePubMed
TargetNeuraminidase(Influenza B virus)
Csiro Manufacturing
Curated by ChEMBL
LigandPNGBDBM50271298(CHEMBL4128362)
Affinity DataIC50:  65nM. Assay description: Inhibition of Influenza B virus (B/Perth/211/2001) neuraminidase activity using 4-MUNANA as substrate preincubated for 60 mins followed by substrate ...
In DepthDetails ArticlePubMed
TargetNeuraminidase(Influenza B virus (B/Lee/40))
Csiro Manufacturing
Curated by ChEMBL
LigandPNGBDBM50271298(CHEMBL4128362)
Affinity DataIC50:  1.26E+3nM. Assay description: Inhibition of Influenza B virus (B/Perth/211/2001) neuraminidase D197E mutant activity using 4-MUNANA as substrate measured every min for 60 mins by ...
In DepthDetails ArticlePubMed
TargetNeuraminidase(Influenza B virus (B/Lee/40))
Csiro Manufacturing
Curated by ChEMBL
LigandPNGBDBM50271298(CHEMBL4128362)
Affinity DataIC50:  174nM. Assay description: Inhibition of Influenza B virus (B/Perth/211/2001) neuraminidase D197E mutant activity using 4-MUNANA as substrate preincubated for 60 mins followed ...
In DepthDetails ArticlePubMed
TargetNeuraminidase(Influenza A virus (A/Brisbane/59/2007(H1N1)))
Csiro Manufacturing
Curated by ChEMBL
LigandPNGBDBM50271298(CHEMBL4128362)
Affinity DataIC50:  465nM. Assay description: Inhibition of Influenza A virus (A/Fukui/45/04(H3N2)) neuraminidase E119V mutant activity using 4-MUNANA as substrate measured every min for 60 mins ...
In DepthDetails ArticlePubMed
TargetNeuraminidase(Influenza A virus (A/Brisbane/59/2007(H1N1)))
Csiro Manufacturing
Curated by ChEMBL
LigandPNGBDBM50271298(CHEMBL4128362)
Affinity DataIC50:  238nM. Assay description: Inhibition of Influenza A virus (A/Fukui/45/04(H3N2)) neuraminidase E119V mutant activity using 4-MUNANA as substrate preincubated for 60 mins follow...
In DepthDetails ArticlePubMed
TargetNeuraminidase(Influenza A virus)
Csiro Manufacturing
Curated by ChEMBL
LigandPNGBDBM50271298(CHEMBL4128362)
Affinity DataIC50:  1.20E+3nM. Assay description: Inhibition of Influenza A virus (A/NWS/G70C(H1N9)) neuraminidase E119G mutant activity using 4-MUNANA as substrate measured every min for 60 mins by ...
In DepthDetails ArticlePubMed
TargetNeuraminidase(Influenza A virus)
Csiro Manufacturing
Curated by ChEMBL
LigandPNGBDBM50271298(CHEMBL4128362)
Affinity DataIC50:  1.15E+3nM. Assay description: Inhibition of Influenza A virus (A/NWS/G70C(H1N9)) neuraminidase E119G mutant activity using 4-MUNANA as substrate preincubated for 60 mins followed ...
In DepthDetails ArticlePubMed
TargetNeuraminidase(Influenza A virus)
Csiro Manufacturing
Curated by ChEMBL
LigandPNGBDBM50271298(CHEMBL4128362)
Affinity DataIC50:  80nM. Assay description: Inhibition of Influenza A virus (A/Mississippi/03/01 (H1N1)) neuraminidase activity using 4-MUNANA as substrate preincubated for 60 mins followed by ...
In DepthDetails ArticlePubMed
TargetNeuraminidase(Influenza A virus)
Csiro Manufacturing
Curated by ChEMBL
LigandPNGBDBM50271298(CHEMBL4128362)
Affinity DataIC50:  139nM. Assay description: Inhibition of Influenza A virus (A/Mississippi/03/01 (H1N1)) neuraminidase H274Y mutant using 4-MUNANA as substrate measured every min for 60 mins by...
In DepthDetails ArticlePubMed
TargetNeuraminidase(Influenza A virus)
Csiro Manufacturing
Curated by ChEMBL
LigandPNGBDBM50271298(CHEMBL4128362)
Affinity DataIC50:  1.66E+3nM. Assay description: Inhibition of Influenza A virus (A/chicken/Vietnam/08/2004 (H5N1)) clade 1 neuraminidase activity using 4-MUNANA as substrate preincubated for 60 min...
In DepthDetails ArticlePubMed
TargetNeuraminidase(Influenza A virus)
Csiro Manufacturing
Curated by ChEMBL
LigandPNGBDBM50271298(CHEMBL4128362)
Affinity DataIC50:  889nM. Assay description: Inhibition of Influenza A virus (A/chicken/Bangli/BBVD-563/2007(H5N1)) clade 2 neuraminidase activity using 4-MUNANA as substrate measured every min ...
In DepthDetails ArticlePubMed
TargetNeuraminidase(Influenza A virus)
Csiro Manufacturing
Curated by ChEMBL
LigandPNGBDBM50271298(CHEMBL4128362)
Affinity DataIC50:  116nM. Assay description: Inhibition of Influenza A virus (A/Mississippi/03/01 (H1N1)) neuraminidase H274Y mutant using 4-MUNANA as substrate preincubated for 60 mins followed...
In DepthDetails ArticlePubMed
TargetNeuraminidase(Influenza A virus)
Csiro Manufacturing
Curated by ChEMBL
LigandPNGBDBM50271298(CHEMBL4128362)
Affinity DataIC50:  791nM. Assay description: Inhibition of Influenza A virus (A/California/07/09 (H1N1)) neuraminidase activity using 4-MUNANA as substrate measured every min for 60 mins by fluo...
In DepthDetails ArticlePubMed
TargetNeuraminidase(Influenza A virus)
Csiro Manufacturing
Curated by ChEMBL
LigandPNGBDBM50271298(CHEMBL4128362)
Affinity DataIC50:  863nM. Assay description: Inhibition of Influenza A virus (A/chicken/Bangli/BBVD-563/2007(H5N1)) clade 2 neuraminidase activity using 4-MUNANA as substrate preincubated for 60...
In DepthDetails ArticlePubMed
TargetNeuraminidase(Influenza A virus (strain A/Memphis/1/1971 H3N2))
Csiro Manufacturing
Curated by ChEMBL
LigandPNGBDBM50271298(CHEMBL4128362)
Affinity DataIC50:  1.67E+3nM. Assay description: Inhibition of Influenza A virus (A/Fukui/45/04(H3N2)) neuraminidase activity using 4-MUNANA as substrate measured every min for 60 mins by fluorescen...
In DepthDetails ArticlePubMed
TargetNeuraminidase(Influenza A virus (strain A/Memphis/1/1971 H3N2))
Csiro Manufacturing
Curated by ChEMBL
LigandPNGBDBM50271298(CHEMBL4128362)
Affinity DataIC50:  1.38E+3nM. Assay description: Inhibition of Influenza A virus (A/Fukui/45/04(H3N2)) neuraminidase activity using 4-MUNANA as substrate preincubated for 60 mins followed by substra...
In DepthDetails ArticlePubMed
TargetNeuraminidase(Influenza A virus)
Csiro Manufacturing
Curated by ChEMBL
LigandPNGBDBM50271298(CHEMBL4128362)
Affinity DataIC50:  601nM. Assay description: Inhibition of Influenza A virus (A/California/07/09 (H1N1)) neuraminidase activity using 4-MUNANA as substrate preincubated for 60 mins followed by s...
In DepthDetails ArticlePubMed
TargetNeuraminidase(Influenza A virus)
Csiro Manufacturing
Curated by ChEMBL
LigandPNGBDBM50271298(CHEMBL4128362)
Affinity DataIC50:  2.17E+3nM. Assay description: Inhibition of Influenza A virus (A/chicken/Vietnam/08/2004 (H5N1)) clade 1 neuraminidase activity using 4-MUNANA as substrate measured every min for ...
In DepthDetails ArticlePubMed