BDBM50272302 5-(beta-D-Galactopyranosyl)-4-methyl-2-benzylaminothiazole::CHEMBL525202
SMILES Cc1nc(NCc2ccccc2)sc1C[C@@H]1O[C@H](CO)[C@H](O)[C@H](O)[C@H]1O
InChI Key InChIKey=SRDLJRCAYKDAMY-QMPXSYISSA-N
Data  2 IC50
  Tab Delimited (TSV)   2D SDfile   Computed 3D by Vconf -m prep SDfile
Find this compound or compounds like it in BindingDB:
Activity Spreadsheet -- Enzyme Inhibition Constant Data from BindingDB
Found 2 hits for monomerid = 50272302
TargetGalectin-3(Homo sapiens (Human))
Universit£
Curated by ChEMBL
LigandPNGBDBM50272302(5-(beta-D-Galactopyranosyl)-4-methyl-2-benzylamino...)
Affinity DataIC50:  2.50E+6nM. Assay description: Inhibition of recombinant galectin 3 in human O type red blood cells by hemagglutination assay
In DepthDetails ArticlePubMed
TargetGalectin-1(Homo sapiens (Human))
Universit£
Curated by ChEMBL
LigandPNGBDBM50272302(5-(beta-D-Galactopyranosyl)-4-methyl-2-benzylamino...)
Affinity DataIC50:  5.00E+6nM. Assay description: Inhibition of recombinant galectin 1 in human O type red blood cells by hemagglutination assay
In DepthDetails ArticlePubMed