BDBM50272332 5-(beta-D-Galactopyranosyl)-4-methyl-2-p-nitro-benzamidothiazole::CHEMBL500124
SMILES Cc1nc(NC(=O)c2ccc(cc2)[N+]([O-])=O)sc1C[C@@H]1O[C@H](CO)[C@H](O)[C@H](O)[C@H]1O
InChI Key InChIKey=LOQGFKUJMBBAGB-PTNZTPPNSA-N
Data  2 IC50
  Tab Delimited (TSV)   2D SDfile   Computed 3D by Vconf -m prep SDfile
Find this compound or compounds like it in BindingDB:
Activity Spreadsheet -- Enzyme Inhibition Constant Data from BindingDB
Found 2 hits for monomerid = 50272332
TargetGalectin-3(Homo sapiens (Human))
Universit£
Curated by ChEMBL
LigandPNGBDBM50272332(5-(beta-D-Galactopyranosyl)-4-methyl-2-p-nitro-ben...)
Affinity DataIC50: >5.00E+6nM. Assay description: Inhibition of recombinant galectin 3 in human O type red blood cells by hemagglutination assay
In DepthDetails ArticlePubMed
TargetGalectin-1(Homo sapiens (Human))
Universit£
Curated by ChEMBL
LigandPNGBDBM50272332(5-(beta-D-Galactopyranosyl)-4-methyl-2-p-nitro-ben...)
Affinity DataIC50: >5.00E+6nM. Assay description: Inhibition of recombinant galectin 1 in human O type red blood cells by hemagglutination assay
In DepthDetails ArticlePubMed