BDBM50276554 (1S,2R)-N-{1-Benzyl-2-hydroxy-3-(S)-[2-(1-benzylpiperidin-4-yl)ethylamino]-propyl}-5-[methyl(methylsulfonyl)amino]-N'-[(R)-1-phenylethyl]isophthalamide::CHEMBL510269
SMILES C[C@@H](NC(=O)c1cc(cc(c1)C(=O)N[C@@H](Cc1ccccc1)[C@H](O)CNCCC1CCN(Cc2ccccc2)CC1)N(C)S(C)(=O)=O)c1ccccc1
InChI Key InChIKey=IMNAYTZSJCRZIO-RLRCJDGOSA-N
Data  3 IC50
PDB links: 1 PDB ID matches this monomer.
  Tab Delimited (TSV)   2D SDfile   Computed 3D by Vconf -m prep SDfile
Find this compound or compounds like it in BindingDB:
Activity Spreadsheet -- Enzyme Inhibition Constant Data from BindingDB
Found 3 hits for monomerid = 50276554
TargetBeta-secretase 1(Homo sapiens (Human))
Chinese Academy Of Sciences
Curated by ChEMBL
LigandPNGBDBM50276554((1S,2R)-N-{1-Benzyl-2-hydroxy-3-(S)-[2-(1-benzylpi...)
Affinity DataIC50:  99nM. Assay description: Inhibition of BACE1 in HEK293 cells transfected with human betaAPP695 mutant assessed as inhibition of amyloid beta (1 to 40) production after 24 hrs...
TargetAcetylcholinesterase(Rattus norvegicus (rat))
Chinese Academy Of Sciences
Curated by ChEMBL
LigandPNGBDBM50276554((1S,2R)-N-{1-Benzyl-2-hydroxy-3-(S)-[2-(1-benzylpi...)
Affinity DataIC50:  1.83E+3nM. Assay description: Inhibition of AChE in rat cortex preincubated for 20 mins by Ellman method
In DepthDetails ArticlePubMed
TargetBeta-secretase 1(Homo sapiens (Human))
Chinese Academy Of Sciences
Curated by ChEMBL
LigandPNGBDBM50276554((1S,2R)-N-{1-Benzyl-2-hydroxy-3-(S)-[2-(1-benzylpi...)
Affinity DataIC50:  567nM. Assay description: Inhibition of human recombinant C-terminal histidine-tagged BACE1 expressed in baculovirus-infected insect cells by FRET assay