BDBM50277360 CHEMBL4166955
SMILES CCOC(=O)c1cn(C)c(=O)cc1Cl
InChI Key InChIKey=WGSWOEOJYNQPRP-UHFFFAOYSA-N
Data  2 Kd
PDB links: 3 PDB IDs match this monomer.
  Tab Delimited (TSV)   2D SDfile   Computed 3D by Vconf -m prep SDfile
Find this compound or compounds like it in BindingDB:
Activity Spreadsheet -- Enzyme Inhibition Constant Data from BindingDB
Found 2 hits for monomerid = 50277360
TargetBromodomain adjacent to zinc finger domain protein 2B(Homo sapiens (Human))
University Of Z£Rich
Curated by ChEMBL
LigandPNGBDBM50277360(CHEMBL4166955)
Affinity DataKd:  8.70E+4nM. Assay description: Binding affinity to human BAZ2B (S2054 to S2168 residues) expressed in bacterial expression system by BROMOscan assay
TargetBromodomain adjacent to zinc finger domain protein 2A(Homo sapiens (Human))
University Of Z£Rich
Curated by ChEMBL
LigandPNGBDBM50277360(CHEMBL4166955)
Affinity DataKd:  5.10E+4nM. Assay description: Binding affinity to human BAZ2A (M1792 to L1905 residues) expressed in bacterial expression system by BROMOscan assay