BDBM50283472 CHEMBL4160748
SMILES COc1ccc(-c2c(C)nn3c(cc(C)nc23)C(F)(F)F)c(F)c1F
InChI Key InChIKey=NYBZCKAQIIPSDS-UHFFFAOYSA-N
Data  1 KI  10 IC50  14 EC50
  Tab Delimited (TSV)   2D SDfile   Computed 3D by Vconf -m prep SDfile
Find this compound or compounds like it in BindingDB:
Activity Spreadsheet -- Enzyme Inhibition Constant Data from BindingDB
Found 25 hits for monomerid = 50283472
TargetSubstance-P receptor(Homo sapiens (Human))
Vanderbilt University
Curated by ChEMBL
LigandPNGBDBM50283472(CHEMBL4160748)
Affinity DataKi:  650nM. Assay description: Displacement of [3H] substance P from recombinant human NK1 receptor expressed in CHO cells after 90 mins by scintillation counting method
In DepthDetails ArticlePubMed
TargetMetabotropic glutamate receptor 8(Homo sapiens (Human))TBA
LigandPNGBDBM50283472(CHEMBL4160748)
Affinity DataEC50:  2.60E+3nM. Assay description: Positive allosteric modulation of mGluR8 (unknown origin)
In DepthDetails PubMed
TargetMetabotropic glutamate receptor 8(Rattus norvegicus (Rat))
Vanderbilt University
Curated by ChEMBL
LigandPNGBDBM50283472(CHEMBL4160748)
Affinity DataEC50:  2.63E+3nM. Assay description: Positive allosteric modulation of rat mGlu8 receptor expressed in HEK cells co-expressing Galphai5 assessed as increase in glutamate-induced calcium ...
In DepthDetails ArticlePubMed
TargetCytochrome P450 2D6(Homo sapiens (Human))
Vanderbilt University
Curated by ChEMBL
LigandPNGBDBM50283472(CHEMBL4160748)
Affinity DataIC50: >3.00E+4nM. Assay description: Inhibition of CYP2D6 in human liver microsomes using dextromethorphan as substrate preincubated for 15 mins followed by NADPH addition measured after...
In DepthDetails ArticlePubMed
TargetMetabotropic glutamate receptor 4(Homo sapiens (Human))
Vanderbilt University
Curated by ChEMBL
LigandPNGBDBM50283472(CHEMBL4160748)
Affinity DataEC50: <1.00E+4nM. Assay description: Positive allosteric modulation of human mGlu4 receptor expressed in CHO cells co-expressing Gqi5 assessed as increase in glutamate-induced calcium mo...
In DepthDetails ArticlePubMed
TargetMetabotropic glutamate receptor 4(Homo sapiens (Human))
Vanderbilt University
Curated by ChEMBL
LigandPNGBDBM50283472(CHEMBL4160748)
Affinity DataEC50: >1.00E+4nM. Assay description: Positive allosteric modulation of human mGlu4 receptor expressed in CHO cells co-expressing Gqi5 assessed as increase in glutamate-induced calcium mo...
In DepthDetails ArticlePubMed
TargetMetabotropic glutamate receptor 2(Rattus norvegicus)
Vanderbilt University
Curated by ChEMBL
LigandPNGBDBM50283472(CHEMBL4160748)
Affinity DataEC50: >1.00E+4nM. Assay description: Positive allosteric modulation of rat mGlu2 receptor expressed in HEK cells assessed as increase in glutamate-induced calcium flux incubated for 142 ...
In DepthDetails ArticlePubMed
TargetMetabotropic glutamate receptor 2(Rattus norvegicus)
Vanderbilt University
Curated by ChEMBL
LigandPNGBDBM50283472(CHEMBL4160748)
Affinity DataIC50: >1.00E+4nM. Assay description: Negative allosteric modulation of rat mGlu2 receptor expressed in HEK cells assessed as decrease in glutamate-induced thallium flux incubated for 142...
In DepthDetails ArticlePubMed
TargetMetabotropic glutamate receptor 6(Homo sapiens (Human))
Vanderbilt University
Curated by ChEMBL
LigandPNGBDBM50283472(CHEMBL4160748)
Affinity DataIC50: >1.00E+4nM. Assay description: Negative allosteric modulation of human mGlu6 receptor expressed in HEK cells harboring GIRK channel assessed as decrease in glutamate-induced thalli...
In DepthDetails ArticlePubMed
TargetMetabotropic glutamate receptor 1(RAT)
Vanderbilt University
Curated by ChEMBL
LigandPNGBDBM50283472(CHEMBL4160748)
Affinity DataEC50: >1.00E+4nM. Assay description: Positive allosteric modulation of rat mGlu1 receptor expressed in HEK cells assessed as increase in glutamate-induced calcium flux incubated for 142 ...
In DepthDetails ArticlePubMed
TargetMetabotropic glutamate receptor 8(Rattus norvegicus (Rat))
Vanderbilt University
Curated by ChEMBL
LigandPNGBDBM50283472(CHEMBL4160748)
Affinity DataEC50:  2.60E+3nM. Assay description: Positive allosteric modulation of rat mGlu8 receptor expressed in HEK cells co-expressing Galphai5 assessed as increase in glutamate-induced calcium ...
In DepthDetails ArticlePubMed
TargetMetabotropic glutamate receptor 7(Rattus norvegicus (Rat))
Vanderbilt University
Curated by ChEMBL
LigandPNGBDBM50283472(CHEMBL4160748)
Affinity DataEC50:  646nM. Assay description: Positive allosteric modulation of rat mGlu7 receptor expressed in HEK cells co-expressing Galphai5 assessed as increase in glutamate-induced calcium ...
In DepthDetails ArticlePubMed
TargetSubstance-P receptor(Homo sapiens (Human))
Vanderbilt University
Curated by ChEMBL
LigandPNGBDBM50283472(CHEMBL4160748)
Affinity DataIC50:  3.40E+3nM. Assay description: Displacement of [3H] substance P from recombinant human NK1 receptor expressed in CHO cells after 90 mins by scintillation counting method
In DepthDetails ArticlePubMed
TargetCytochrome P450 1A2(Homo sapiens (Human))
Vanderbilt University
Curated by ChEMBL
LigandPNGBDBM50283472(CHEMBL4160748)
Affinity DataIC50:  3.08E+3nM. Assay description: Inhibition of CYP1A2 in human liver microsomes using phenacetin as substrate preincubated for 15 mins followed by NADPH addition measured after 8 min...
In DepthDetails ArticlePubMed
TargetCytochrome P450 2C9(Homo sapiens (Human))
Vanderbilt University
Curated by ChEMBL
LigandPNGBDBM50283472(CHEMBL4160748)
Affinity DataIC50:  2.47E+4nM. Assay description: Inhibition of CYP2C9 in human liver microsomes using diclofenac as substrate preincubated for 15 mins followed by NADPH addition measured after 8 min...
In DepthDetails ArticlePubMed
TargetCytochrome P450 3A4(Homo sapiens (Human))
Vanderbilt University
Curated by ChEMBL
LigandPNGBDBM50283472(CHEMBL4160748)
Affinity DataIC50: >3.00E+4nM. Assay description: Inhibition of CYP3A4 in human liver microsomes using midazolam as substrate preincubated for 15 mins followed by NADPH addition measured after 8 mins...
In DepthDetails ArticlePubMed
TargetMetabotropic glutamate receptor 3(Rattus norvegicus (Rat))
Vanderbilt University
Curated by ChEMBL
LigandPNGBDBM50283472(CHEMBL4160748)
Affinity DataEC50: >1.00E+4nM. Assay description: Positive allosteric modulation of rat mGlu3 receptor expressed in HEK cells assessed as increase in glutamate-induced calcium flux incubated for 142 ...
In DepthDetails ArticlePubMed
TargetMetabotropic glutamate receptor 1(RAT)
Vanderbilt University
Curated by ChEMBL
LigandPNGBDBM50283472(CHEMBL4160748)
Affinity DataIC50: >1.00E+4nM. Assay description: Negative allosteric modulation of rat mGlu1 receptor expressed in HEK cells assessed as decrease in glutamate-induced thallium flux incubated for 142...
In DepthDetails ArticlePubMed
TargetMetabotropic glutamate receptor 5(Rattus norvegicus (Rat))
Vanderbilt University
Curated by ChEMBL
LigandPNGBDBM50283472(CHEMBL4160748)
Affinity DataIC50: >1.00E+4nM. Assay description: Negative allosteric modulation of rat mGlu5 receptor expressed in HEK cells assessed as decrease in glutamate-induced thallium flux incubated for 142...
In DepthDetails ArticlePubMed
TargetMetabotropic glutamate receptor 6(Homo sapiens (Human))
Vanderbilt University
Curated by ChEMBL
LigandPNGBDBM50283472(CHEMBL4160748)
Affinity DataEC50: >1.00E+4nM. Assay description: Positive allosteric modulation of human mGlu6 receptor expressed in HEK cells assessed as increase in glutamate-induced calcium flux incubated for 14...
In DepthDetails ArticlePubMed
TargetMetabotropic glutamate receptor 7(Rattus norvegicus (Rat))
Vanderbilt University
Curated by ChEMBL
LigandPNGBDBM50283472(CHEMBL4160748)
Affinity DataEC50:  650nM. Assay description: Positive allosteric modulation of rat mGlu7 receptor expressed in HEK cells co-expressing Galphai5 assessed as increase in glutamate-induced calcium ...
In DepthDetails ArticlePubMed
TargetMetabotropic glutamate receptor 4(Homo sapiens (Human))
Vanderbilt University
Curated by ChEMBL
LigandPNGBDBM50283472(CHEMBL4160748)
Affinity DataEC50: >1.00E+4nM. Assay description: Positive allosteric modulation of mGluR4 (unknown origin)
In DepthDetails PubMed
TargetMetabotropic glutamate receptor 7(Homo sapiens (Human))TBA
LigandPNGBDBM50283472(CHEMBL4160748)
Affinity DataEC50:  649nM. Assay description: Positive allosteric modulation of mGluR7 (unknown origin)
In DepthDetails PubMed
TargetMetabotropic glutamate receptor 3(Rattus norvegicus (Rat))
Vanderbilt University
Curated by ChEMBL
LigandPNGBDBM50283472(CHEMBL4160748)
Affinity DataIC50: >1.00E+4nM. Assay description: Negative allosteric modulation of rat mGlu3 receptor expressed in HEK cells harboring GIRK channel assessed as decrease in glutamate-induced thallium...
In DepthDetails ArticlePubMed
TargetMetabotropic glutamate receptor 5(Rattus norvegicus (Rat))
Vanderbilt University
Curated by ChEMBL
LigandPNGBDBM50283472(CHEMBL4160748)
Affinity DataEC50: >1.00E+4nM. Assay description: Positive allosteric modulation of rat mGlu5 receptor expressed in HEK cells assessed as increase in glutamate-induced calcium flux incubated for 142 ...
In DepthDetails ArticlePubMed