BDBM50316345 2-(5-{[(2S)-2-Aminobutyl]oxy}pyridin-3-yl)-8,9-dimethoxybenzo[c]-2,7-naphthyridin-4-amine::CHEMBL1097956
SMILES CC[C@H](N)COc1cncc(c1)-c1cc2c(cnc3cc(OC)c(OC)cc23)c(N)n1
InChI Key InChIKey=PHJGKALEAVCXAU-AWEZNQCLSA-N
Data  3 IC50
  Tab Delimited (TSV)   2D SDfile   Computed 3D by Vconf -m prep SDfile
Find this compound or compounds like it in BindingDB:
Activity Spreadsheet -- Enzyme Inhibition Constant Data from BindingDB
Found 3 hits for monomerid = 50316345
Target3-phosphoinositide-dependent protein kinase 1(Homo sapiens (Human))
Wyeth Research
Curated by ChEMBL
LigandPNGBDBM50316345(2-(5-{[(2S)-2-Aminobutyl]oxy}pyridin-3-yl)-8,9-dim...)
Affinity DataIC50:  6nM. Assay description: Inhibition of human GST-tagged-PDK1 expressed in HEK293 cells
In DepthDetails ArticlePubMed
TargetRibosomal protein S6 kinase beta-1(Homo sapiens (Human))
Wyeth Research
Curated by ChEMBL
LigandPNGBDBM50316345(2-(5-{[(2S)-2-Aminobutyl]oxy}pyridin-3-yl)-8,9-dim...)
Affinity DataIC50:  216nM. Assay description: Inhibition of p70S6K
In DepthDetails ArticlePubMed
TargetRAC-alpha serine/threonine-protein kinase(Homo sapiens (Human))
Wyeth Research
Curated by ChEMBL
LigandPNGBDBM50316345(2-(5-{[(2S)-2-Aminobutyl]oxy}pyridin-3-yl)-8,9-dim...)
Affinity DataIC50:  422nM. Assay description: Inhibition of AKT
In DepthDetails ArticlePubMed