BDBM50329018 (2-(3-fluoro-2-methylbenzyl)-5-hydroxy-4-methyl-1-phenyl-1H-indol-3-yl)(piperazin-1-yl)methanone::2-(3-fluoro-2-methylbenzyl)-4-methyl-1-phenyl-3-(piperazin-1-ylcarbonyl)-1H-indol-5-ol::CHEMBL1236060
SMILES Cc1c(F)cccc1Cc1c(C(=O)N2CCNCC2)c2c(C)c(O)ccc2n1-c1ccccc1
InChI Key InChIKey=LWFGTVRNQYOUHL-UHFFFAOYSA-N
Data  1 IC50
PDB links: 1 PDB ID matches this monomer.
  Tab Delimited (TSV)   2D SDfile   Computed 3D by Vconf -m prep SDfile
Find this compound or compounds like it in BindingDB:
Activity Spreadsheet -- Enzyme Inhibition Constant Data from BindingDB
Found 1 hit for monomerid = 50329018
TargetRenin(Homo sapiens (Human))
Sanofi-Aventis Deutschland
Curated by ChEMBL
LigandPNGBDBM50329018((2-(3-fluoro-2-methylbenzyl)-5-hydroxy-4-methyl-1-...)
Affinity DataIC50:  2nM. Assay description: Inhibition of human recombinant renin using flurorogenic substrate by microplate spectrofluorometer