BDBM50332017 CHEMBL4165382
SMILES NC(=O)c1cc2c(NC(=O)C34CC5CC(CC(N)(C5)C3)C4)cccc2[nH]1
InChI Key InChIKey=WGKDLQGKGXBCBV-UHFFFAOYSA-N
Data  1 Kd
PDB links: 1 PDB ID matches this monomer.
  Tab Delimited (TSV)   2D SDfile   Computed 3D by Vconf -m prep SDfile
Find this compound or compounds like it in BindingDB:
Activity Spreadsheet -- Enzyme Inhibition Constant Data from BindingDB
Found 1 hit for monomerid = 50332017
TargetComplement factor D(Homo sapiens (Human))
Novartis Pharma
Curated by ChEMBL
LigandPNGBDBM50332017(CHEMBL4165382)
Affinity DataKd: >2.00E+6nM. Assay description: Binding affinity to 15-N labeled complement factor D (unknown origin) by 1H-15N HSQC NMR analysis