BDBM50345194 6-((1-(3-hydroxypropyl)-1,8a-dihydroquinolin-7-yloxy)methyl)-1-(4-(3-(2-methoxybenzyloxy)propoxy)phenyl)piperazin-2-one::CHEMBL1783189
SMILES COc1ccccc1COCCCOc1ccc(cc1)N1C(COC2=CC3N(CCCO)C=CC=C3C=C2)CNCC1=O
InChI Key InChIKey=BSWXEYZBVSQHOV-UHFFFAOYSA-N
Data  1 IC50
PDB links: 2 PDB IDs match this monomer.
  Tab Delimited (TSV)   2D SDfile   Computed 3D by Vconf -m prep SDfile
Find this compound or compounds like it in BindingDB:
Activity Spreadsheet -- Enzyme Inhibition Constant Data from BindingDB
Found 1 hit for monomerid = 50345194
TargetRenin(Homo sapiens (Human))
Gyeongsang National University (Gnu)
Curated by ChEMBL
LigandPNGBDBM50345194(6-((1-(3-hydroxypropyl)-1,8a-dihydroquinolin-7-ylo...)
Affinity DataIC50:  37nM. Assay description: Inhibition of human renin