BDBM50345705 1-(1-methylethyl)-3-(naphthalen-1-ylmethyl)-1H-pyrazolo[3,4-d]pyrimidin-4-amine::1-isopropyl-3-(naphthalen-1-ylmethyl)-1H-pyrazolo[3,4-d]pyrimidin-4-amine::CHEMBL1231370::CHEMBL2069954::US10544104, Compound 3::US11247972, Compound 3::US9765037, Compound 3
SMILES CC(C)n1nc(Cc2cccc3ccccc23)c2c(N)ncnc12
InChI Key InChIKey=QFGDRGRJMYSRIW-UHFFFAOYSA-N
Data  20 IC50
PDB links: 2 PDB IDs match this monomer.
  Tab Delimited (TSV)   2D SDfile   Computed 3D by Vconf -m prep SDfile
Find this compound or compounds like it in BindingDB:
Activity Spreadsheet -- Enzyme Inhibition Constant Data from BindingDB
Found 20 hits for monomerid = 50345705
TargetCalmodulin-domain protein kinase 1(Toxoplasma gondii)
University Of Washington
Curated by ChEMBL
LigandPNGBDBM50345705(1-(1-methylethyl)-3-(naphthalen-1-ylmethyl)-1H-pyr...)
Affinity DataIC50:  130nM. Assay description: Inhibition of Toxoplasma gondii recombinant N-terminal hexahistidine tagged CDPK1 expressed in Escherichia coli using syntide-2 as substrate after 90...
TargetCalcium/calmodulin dependent protein kinase with a kinas domain and 4 calmodulin-like EF hands(Cryptosporidium parvum (strain Iowa II))
University Of Washington Through Its Center For Commercialization
US Patent
LigandPNGBDBM50345705(1-(1-methylethyl)-3-(naphthalen-1-ylmethyl)-1H-pyr...)
Affinity DataIC50:  147nM. Assay description: Inhibition of TgCDPK1 and CpCDPK1 was determined using a luminescent kinase assay which measures ATP depletion in the presence of the Syntide 2 pepti...
In DepthDetails US Patent
TargetProto-oncogene tyrosine-protein kinase Src(Homo sapiens (Human))
University Of Washington Through Its Center For Commercialization
US Patent
LigandPNGBDBM50345705(1-(1-methylethyl)-3-(naphthalen-1-ylmethyl)-1H-pyr...)
Affinity DataIC50:  8.80E+3nM. Assay description: Inhibition of human tyrosine kinases.
In DepthDetails US Patent
TargetTyrosine-protein kinase ABL1(Homo sapiens (Human))
University Of Washington Through Its Center For Commercialization
US Patent
LigandPNGBDBM50345705(1-(1-methylethyl)-3-(naphthalen-1-ylmethyl)-1H-pyr...)
Affinity DataIC50:  7.90E+3nM. Assay description: Inhibition of human tyrosine kinases.
In DepthDetails US Patent
TargetTyrosine-protein kinase HCK(Homo sapiens (Human))
University Of Washington Through Its Center For Commercialization
US Patent
LigandPNGBDBM50345705(1-(1-methylethyl)-3-(naphthalen-1-ylmethyl)-1H-pyr...)
Affinity DataIC50:  1.38E+3nM. Assay description: Inhibition of human tyrosine kinases.
In DepthDetails US Patent
TargetCalmodulin-domain protein kinase 1(Toxoplasma gondii)
University Of Washington
Curated by ChEMBL
LigandPNGBDBM50345705(1-(1-methylethyl)-3-(naphthalen-1-ylmethyl)-1H-pyr...)
Affinity DataIC50:  128nM. Assay description: Most known kinase inhibitors bind in the ATP-binding pocket of the active site19,20. These inhibitors exploit many of the same hydrophobic contacts a...
TargetCalcium-dependent protein kinase 1(Cryptosporidium parvum)
University Of Washington Through Its Center For Commercialization
US Patent
LigandPNGBDBM50345705(1-(1-methylethyl)-3-(naphthalen-1-ylmethyl)-1H-pyr...)
Affinity DataIC50:  147nM. Assay description: Two types of enzyme assays were developed to follow TgCDPK1 activity, a radiometric scintillation proximity assay measured the labeled γ-phospha...
In DepthDetails US Patent
TargetCalmodulin-domain protein kinase 1, putative(Cryptosporidium parvum (strain Iowa II))
University Of Washington Through Its Center For
US Patent
LigandPNGBDBM50345705(1-(1-methylethyl)-3-(naphthalen-1-ylmethyl)-1H-pyr...)
Affinity DataIC50:  150nM. Assay description: Inhibition of TgCDPK1 and CpCDPK1 was determined using a luminescent kinase assay which measures ATP depletion in the presence of the Syntide 2 pepti...
TargetCalmodulin-domain protein kinase 1(Toxoplasma gondii)
University Of Washington
Curated by ChEMBL
LigandPNGBDBM50345705(1-(1-methylethyl)-3-(naphthalen-1-ylmethyl)-1H-pyr...)
Affinity DataIC50:  103nM. Assay description: Inhibition of TgCDPK1 and CpCDPK1 was determined using a luminescent kinase assay which measures ATP depletion in the presence of the Syntide 2 pepti...
TargetCalmodulin-domain protein kinase 1(Toxoplasma gondii)
University Of Washington
Curated by ChEMBL
LigandPNGBDBM50345705(1-(1-methylethyl)-3-(naphthalen-1-ylmethyl)-1H-pyr...)
Affinity DataIC50:  128nM. Assay description: Inhibition of TgCDPK1 and CpCDPK1 was determined using a luminescent kinase assay which measures ATP depletion in the presence of the Syntide 2 pepti...
TargetCalmodulin-domain protein kinase 1, putative(Cryptosporidium parvum (strain Iowa II))
University Of Washington Through Its Center For
US Patent
LigandPNGBDBM50345705(1-(1-methylethyl)-3-(naphthalen-1-ylmethyl)-1H-pyr...)
Affinity DataIC50:  147nM. Assay description: Inhibition of TgCDPK1 and CpCDPK1 was determined using a luminescent kinase assay which measures ATP depletion in the presence of the Syntide 2 pepti...
TargetProto-oncogene tyrosine-protein kinase Src(Homo sapiens (Human))
University Of Washington Through Its Center For Commercialization
US Patent
LigandPNGBDBM50345705(1-(1-methylethyl)-3-(naphthalen-1-ylmethyl)-1H-pyr...)
Affinity DataIC50:  8.80E+3nM. Assay description: Inhibition of TgCDPK1 and CpCDPK1 was determined using a luminescent kinase assay which measures ATP depletion in the presence of the Syntide 2 pepti...
In DepthDetails US Patent
TargetTyrosine-protein kinase ABL1(Homo sapiens (Human))
University Of Washington Through Its Center For Commercialization
US Patent
LigandPNGBDBM50345705(1-(1-methylethyl)-3-(naphthalen-1-ylmethyl)-1H-pyr...)
Affinity DataIC50:  7.90E+3nM. Assay description: Inhibition of TgCDPK1 and CpCDPK1 was determined using a luminescent kinase assay which measures ATP depletion in the presence of the Syntide 2 pepti...
In DepthDetails US Patent
TargetTyrosine-protein kinase HCK(Homo sapiens (Human))
University Of Washington Through Its Center For Commercialization
US Patent
LigandPNGBDBM50345705(1-(1-methylethyl)-3-(naphthalen-1-ylmethyl)-1H-pyr...)
Affinity DataIC50:  1.38E+3nM. Assay description: Inhibition of TgCDPK1 and CpCDPK1 was determined using a luminescent kinase assay which measures ATP depletion in the presence of the Syntide 2 pepti...
In DepthDetails US Patent
TargetCalcium/calmodulin dependent protein kinase with a kinas domain and 4 calmodulin-like EF hands(Cryptosporidium parvum (strain Iowa II))
University Of Washington Through Its Center For Commercialization
US Patent
LigandPNGBDBM50345705(1-(1-methylethyl)-3-(naphthalen-1-ylmethyl)-1H-pyr...)
Affinity DataIC50:  150nM. Assay description: Kinase phosphorylation reactions were performed in a buffered medium containing 20 mM HEPES pH 7.5 (KOH), 0.1% BSA, 10 mM MgCl2, 1 mM EGTA (pH 7.2), ...
In DepthDetails US Patent
TargetcGMP-dependent protein kinase()
University Of Washington Through Its Center For Commercialization
US Patent
LigandPNGBDBM50345705(1-(1-methylethyl)-3-(naphthalen-1-ylmethyl)-1H-pyr...)
Affinity DataIC50:  130nM. Assay description: Kinase phosphorylation reactions were performed in a buffered medium containing 20 mM HEPES pH 7.5 (KOH), 0.1% BSA, 10 mM MgCl2, 1 mM EGTA (pH 7.2), ...
In DepthDetails US Patent
TargetTyrosine-protein kinase ABL1(Homo sapiens (Human))
University Of Washington Through Its Center For Commercialization
US Patent
LigandPNGBDBM50345705(1-(1-methylethyl)-3-(naphthalen-1-ylmethyl)-1H-pyr...)
Affinity DataIC50:  7.90E+3nM. Assay description: Kinase phosphorylation reactions were performed in a buffered medium containing 20 mM HEPES pH 7.5 (KOH), 0.1% BSA, 10 mM MgCl2, 1 mM EGTA (pH 7.2), ...
In DepthDetails US Patent
TargetProto-oncogene tyrosine-protein kinase Src(Homo sapiens (Human))
University Of Washington Through Its Center For Commercialization
US Patent
LigandPNGBDBM50345705(1-(1-methylethyl)-3-(naphthalen-1-ylmethyl)-1H-pyr...)
Affinity DataIC50:  8.80E+3nM. Assay description: Kinase phosphorylation reactions were performed in a buffered medium containing 20 mM HEPES pH 7.5 (KOH), 0.1% BSA, 10 mM MgCl2, 1 mM EGTA (pH 7.2), ...
In DepthDetails US Patent
TargetcGMP-dependent protein kinase()
University Of Washington Through Its Center For Commercialization
US Patent
LigandPNGBDBM50345705(1-(1-methylethyl)-3-(naphthalen-1-ylmethyl)-1H-pyr...)
Affinity DataIC50:  128nM. Assay description: Inhibition of TgCDPK1 and CpCDPK1 was determined using a luminescent kinase assay which measures ATP depletion in the presence of the Syntide 2 pepti...
In DepthDetails US Patent
TargetProto-oncogene tyrosine-protein kinase Src(Homo sapiens (Human))
University Of Washington Through Its Center For Commercialization
US Patent
LigandPNGBDBM50345705(1-(1-methylethyl)-3-(naphthalen-1-ylmethyl)-1H-pyr...)
Affinity DataIC50:  8.80E+3nM. Assay description: Inhibition of human SRC using Ac-EIYGEFKKK-OH as substrate after 60 mins by phosphorimaging method
In DepthDetails ArticlePubMed