BDBM50363015 CHEMBL1945701
SMILES FC(F)(F)CCC(=O)N1CCC(CC1)c1nc(no1)-c1nccs1
InChI Key InChIKey=HHWOKDABGQJATF-UHFFFAOYSA-N
Data  1 IC50  1 EC50
PDB links: 1 PDB ID matches this monomer.
  Tab Delimited (TSV)   2D SDfile   Computed 3D by Vconf -m prep SDfile
Find this compound or compounds like it in BindingDB:
Activity Spreadsheet -- Enzyme Inhibition Constant Data from BindingDB
Found 2 hits for monomerid = 50363015
TargetHTH-type transcriptional regulator EthR(Mycobacterium tuberculosis)
University Of Lille
Curated by ChEMBL
LigandPNGBDBM50363015(CHEMBL1945701)
Affinity DataIC50:  2.80E+3nM. Assay description: Inhibition of EthR binding to ethA promoter in 106-bp biotinylated DNA preincubated for 5 mins measured for 3 mins by surface plasmon resonance assay
TargetHTH-type transcriptional regulator EthR(Mycobacterium tuberculosis)
University Of Lille
Curated by ChEMBL
LigandPNGBDBM50363015(CHEMBL1945701)
Affinity DataEC50:  500nM. Assay description: Inhibition of Mycobacterium tuberculosis H37Rv EthR in Mycobacterium tuberculosis H37Rv expressing GFP infected mouse in RAW264.7 cells assessed as p...