BDBM50369169 CHEMBL4160531
SMILES C[C@H](NC(=O)OCc1ccccc1)C(=O)NCC(=O)N[C@@H](CCC(O)=O)C(=O)N[C@@H](CO)C(=O)N[C@@H](Cc1ccc(O)cc1)C(=O)N[C@@H](Cc1ccc(O)cc1)C(=O)N[C@@H](CCC(O)=O)C(N)=O
InChI Key InChIKey=YKVRAFHXUVFDHS-CXEROONLSA-N
Data  1 Kd
  Tab Delimited (TSV)   2D SDfile   Computed 3D by Vconf -m prep SDfile
Find this compound or compounds like it in BindingDB:
Activity Spreadsheet -- Enzyme Inhibition Constant Data from BindingDB
Found 1 hit for monomerid = 50369169
TargetAdenomatous polyposis coli protein(Homo sapiens (Human))
Jinan University
Curated by ChEMBL
LigandPNGBDBM50369169(CHEMBL4160531)
Affinity DataKd:  5.07E+3nM. Assay description: Binding affinity to APC protein (303 to 739 residues) (unknown origin) incubated for 60 mins followed by probe addition and measured after 60 mins by...
In DepthDetails ArticlePubMed