BDBM50370598 CHEMBL1651379
SMILES CCCCCCCC[C@@H](O)Cn1cc2c(N)ncnc2n1
InChI Key InChIKey=AHEGQNDGYVLQET-GFCCVEGCSA-N
Data  2 KI
  Tab Delimited (TSV)   2D SDfile   Computed 3D by Vconf -m prep SDfile
Find this compound or compounds like it in BindingDB:
Activity Spreadsheet -- Enzyme Inhibition Constant Data from BindingDB
Found 2 hits for monomerid = 50370598
TargetAdenosine deaminase(Homo sapiens (Human))
Bar-Ilan University
Curated by ChEMBL
LigandPNGBDBM50370598(CHEMBL1651379)
Affinity DataKi:  0.0530nM. Assay description: Inhibition of adenosine deaminase
In DepthDetails ArticlePubMed
TargetAdenosine deaminase(Bos taurus (bovine))
Universit£
Curated by ChEMBL
LigandPNGBDBM50370598(CHEMBL1651379)
Affinity DataKi:  0.0530nM. Assay description: Inhibitory constant against bovine spleen Adenosine deaminase
In DepthDetails ArticlePubMed