BDBM50386775 CHEMBL2046916
SMILES CNc1nc2nc(-c3ccc(cc3)P(O)(O)=O)n(CCOc3ccc(Cl)cc3)c2c(=O)[nH]1
InChI Key InChIKey=MCYZBWKMUOPJOU-UHFFFAOYSA-N
Data  1 IC50
PDB links: 1 PDB ID matches this monomer.
  Tab Delimited (TSV)   2D SDfile   Computed 3D by Vconf -m prep SDfile
Find this compound or compounds like it in BindingDB:
Activity Spreadsheet -- Enzyme Inhibition Constant Data from BindingDB
Found 1 hit for monomerid = 50386775
TargetEukaryotic translation initiation factor 4E(Homo sapiens (Human))
Amgen
Curated by ChEMBL
LigandPNGBDBM50386775(CHEMBL2046916)
Affinity DataIC50:  95nM. Assay description: Competitive inhibition of [3H]m7-GTP binding to human FLAG-His6 tagged eIF4E expressed in Escherichia coli by scintillation proximity assay