BDBM50418803 CHEMBL1796296
SMILES OC1(CN2CCC1CC2)C#Cc1ccc(Oc2ccc(cc2)C(=O)NCc2ccncc2)cc1
InChI Key InChIKey=FEOIBPWKGPFSTB-UHFFFAOYSA-N
Data  1 IC50
PDB links: 1 PDB ID matches this monomer.
  Tab Delimited (TSV)   2D SDfile   Computed 3D by Vconf -m prep SDfile
Find this compound or compounds like it in BindingDB:
Activity Spreadsheet -- Enzyme Inhibition Constant Data from BindingDB
Found 1 hit for monomerid = 50418803
TargetCollagenase 3(Homo sapiens (Human))
Astrazeneca
Curated by ChEMBL
LigandPNGBDBM50418803(CHEMBL1796296)
Affinity DataIC50:  126nM. Assay description: Inhibition of human recombinant MMP13 using Mca-Pro-cyclohexyl-Ala-Gly-Nva-His-Ala-Dap(Dnp)-NH2 substrate