BDBM50424732 CHEMBL2314209
SMILES Cc1cc(OCCCc2c([nH]c3cc(Cl)ccc23)C(O)=O)cc(C)c1Cl
InChI Key InChIKey=MCMWRWKXPXXZAS-UHFFFAOYSA-N
Data  9 KI
PDB links: 2 PDB IDs match this monomer.
  Tab Delimited (TSV)   2D SDfile   Computed 3D by Vconf -m prep SDfile
Find this compound or compounds like it in BindingDB:
Activity Spreadsheet -- Enzyme Inhibition Constant Data from BindingDB
Found 9 hits for monomerid = 50424732
TargetInduced myeloid leukemia cell differentiation protein Mcl-1(Homo sapiens (Human))
Vanderbilt University School Of Medicine
Curated by ChEMBL
LigandPNGBDBM50424732(CHEMBL2314209)
Affinity DataKi:  55nM. Assay description: Displacement of FITC-Bak-BH3 peptide probe from N-terminal His-tagged human Mcl-1 (172 to 327 residues) expressed in Escherichia coli BL21(DE3) after...
TargetInduced myeloid leukemia cell differentiation protein Mcl-1(Homo sapiens (Human))
Vanderbilt University School Of Medicine
Curated by ChEMBL
LigandPNGBDBM50424732(CHEMBL2314209)
Affinity DataKi:  55nM. Assay description: Displacement of FITC-AHx-KALETLRRVGDGVQRNHETAF-NH2 from human MCl1 (172 to 327) expressed in Escherichia coli BL21 (DE3) after 1 hr by fluorescence p...
TargetInduced myeloid leukemia cell differentiation protein Mcl-1(Homo sapiens (Human))
Vanderbilt University School Of Medicine
Curated by ChEMBL
LigandPNGBDBM50424732(CHEMBL2314209)
Affinity DataKi:  55nM. Assay description: Inhibition of Mcl1 (unknown origin) by fluorescence polarization assay
TargetInduced myeloid leukemia cell differentiation protein Mcl-1(Homo sapiens (Human))
Vanderbilt University School Of Medicine
Curated by ChEMBL
LigandPNGBDBM50424732(CHEMBL2314209)
Affinity DataKi:  247nM. Assay description: Inhibition of MCL-1 (unknown origin) by fluorescence polarization competition assay
TargetApoptosis regulator Bcl-2(Homo sapiens (Human))
Vanderbilt University School Of Medicine
Curated by ChEMBL
LigandPNGBDBM50424732(CHEMBL2314209)
Affinity DataKi:  870nM. Assay description: Displacement of FITC-AHx-GQVGRQLAIIGDDINR-NH2 from Bcl2 (unknown origin) after 1 hr by fluorescence polarization anisotropy assay
In DepthDetails ArticlePubMed
TargetApoptosis regulator Bcl-2(Homo sapiens (Human))
Vanderbilt University School Of Medicine
Curated by ChEMBL
LigandPNGBDBM50424732(CHEMBL2314209)
Affinity DataKi:  1.20E+3nM. Assay description: Inhibition of BCL-2 (unknown origin) by fluorescence polarization competition assay
In DepthDetails PubMed
TargetInduced myeloid leukemia cell differentiation protein Mcl-1(Homo sapiens (Human))
Vanderbilt University School Of Medicine
Curated by ChEMBL
LigandPNGBDBM50424732(CHEMBL2314209)
Affinity DataKi:  1.90E+3nM. Assay description: Inhibition of His6-tagged MCL1 (unknown origin) incubated for 0.5 hrs in presence of 1% FBS by TR-FRET assay
TargetBcl-2-like protein 1(Homo sapiens (Human))
University Of Maryland
Curated by ChEMBL
LigandPNGBDBM50424732(CHEMBL2314209)
Affinity DataKi: >1.00E+4nM. Assay description: Inhibition of BCL-xL (unknown origin) by fluorescence polarization competition assay
In DepthDetails PubMed
TargetBcl-2-like protein 1(Homo sapiens (Human))
University Of Maryland
Curated by ChEMBL
LigandPNGBDBM50424732(CHEMBL2314209)
Affinity DataKi: >1.50E+4nM. Assay description: Displacement of FITC-AHx-GQVGRQLAIIGDDINR-NH2 from Bcl-xL (unknown origin) after 1 hr by fluorescence polarization anisotropy assay
In DepthDetails ArticlePubMed