BDBM50435228 CHEMBL460432
SMILES Cc1nc(nc(N2CCN(CCO)CC2)c1Cl)-c1ccccn1
InChI Key InChIKey=NLGYGVCRRXIJRR-UHFFFAOYSA-N
Data  2 IC50
PDB links: 1 PDB ID matches this monomer.
  Tab Delimited (TSV)   2D SDfile   Computed 3D by Vconf -m prep SDfile
Find this compound or compounds like it in BindingDB:
Activity Spreadsheet -- Enzyme Inhibition Constant Data from BindingDB
Found 2 hits for monomerid = 50435228
TargetMethionine aminopeptidase 1(Homo sapiens (Human))
Chinese Academy Of Sciences
Curated by ChEMBL
LigandPNGBDBM50435228(CHEMBL460432)
Affinity DataIC50:  1.10E+3nM. Assay description: Inhibition of human recombinant full-length cytosolic METAP1 expressed in Escherichia coli BL21(DE3) using Met-Pro-p-nitroanilide as substrate after ...
TargetMicrotubule-associated protein 2(Homo sapiens (Human))
Chinese Academy Of Sciences
Curated by ChEMBL
LigandPNGBDBM50435228(CHEMBL460432)
Affinity DataIC50: >1.00E+5nM. Assay description: Inhibition of human recombinant GST-6XHis-tagged full-length cytosolic METAP2 expressed in cabbage looper BTI-TN-5B1-4 cells using Met-Pro-p-nitroani...
In DepthDetails ArticlePubMed