BDBM50437794 CHEMBL2407192
SMILES ON(CCC(c1ccc(Cl)c(Cl)c1)P(O)(O)=O)C(=O)c1ccccc1Cn1cncn1
InChI Key InChIKey=CGKYBZFXVQNZBL-UHFFFAOYSA-N
Data  1 IC50  1 Kd
PDB links: 1 PDB ID matches this monomer.
  Tab Delimited (TSV)   2D SDfile   Computed 3D by Vconf -m prep SDfile
Find this compound or compounds like it in BindingDB:
Activity Spreadsheet -- Enzyme Inhibition Constant Data from BindingDB
Found 2 hits for monomerid = 50437794
Target1-deoxy-D-xylulose 5-phosphate reductoisomerase(Mycobacterium tuberculosis)
Uppsala University
Curated by ChEMBL
LigandPNGBDBM50437794(CHEMBL2407192)
Affinity DataIC50:  1.30E+4nM. Assay description: Inhibition of Mycobacterium tuberculosis DXR using DXP as substrate measured every 5 secs for 250 secs in presence of NADPH
Target1-deoxy-D-xylulose 5-phosphate reductoisomerase(Mycobacterium tuberculosis)
Uppsala University
Curated by ChEMBL
LigandPNGBDBM50437794(CHEMBL2407192)
Affinity DataKd:  40nM. Assay description: Binding affinity to Mycobacterium tuberculosis DXR assessed as dissociation constant by spectrofluorimetric analysis in presence of NADPH and MnCl2