BDBM50443047 CHEMBL3087807
SMILES CCN(CC)CCNS(=O)(=O)Cc1ccc(F)cc1
InChI Key InChIKey=UKOZIEJMLUYTMK-UHFFFAOYSA-N
Data  1 IC50
PDB links: 1 PDB ID matches this monomer.
  Tab Delimited (TSV)   2D SDfile   Computed 3D by Vconf -m prep SDfile
Find this compound or compounds like it in BindingDB:
Activity Spreadsheet -- Enzyme Inhibition Constant Data from BindingDB
Found 1 hit for monomerid = 50443047
TargetAcetylcholinesterase(Mus musculus (mouse))
Ume£
Curated by ChEMBL
LigandPNGBDBM50443047(CHEMBL3087807)
Affinity DataIC50:  4.00E+4nM. Assay description: Inhibition of mouse recombinant AChE using acetylthiocholine iodide as substrate by Ellman's method