BDBM50448646 CHEMBL3127517
SMILES [O-][N+](=O)c1ccc(NC(=O)C2CC2)cc1
InChI Key InChIKey=PXCMXAOVWGQBSS-UHFFFAOYSA-N
Data  1 Kd
PDB links: 1 PDB ID matches this monomer.
  Tab Delimited (TSV)   2D SDfile   Computed 3D by Vconf -m prep SDfile
Find this compound or compounds like it in BindingDB:
Activity Spreadsheet -- Enzyme Inhibition Constant Data from BindingDB
Found 1 hit for monomerid = 50448646
TargetNicotinamide phosphoribosyltransferase(Homo sapiens (Human))
Genentech
Curated by ChEMBL
LigandPNGBDBM50448646(CHEMBL3127517)
Affinity DataKd:  5.10E+4nM. Assay description: Binding affinity to NAMPT (2 to 491) (unknown origin) by surface plasmon resonance analysis