BDBM50453018 CHEMBL4203592
SMILES Fc1cccc(NC(=O)c2coc3ccccc3c2=O)c1
InChI Key InChIKey=OUROIBLACYVZRJ-UHFFFAOYSA-N
Data  1 KI
PDB links: 1 PDB ID matches this monomer.
  Tab Delimited (TSV)   2D SDfile   Computed 3D by Vconf -m prep SDfile
Find this compound or compounds like it in BindingDB:
Activity Spreadsheet -- Enzyme Inhibition Constant Data from BindingDB
Found 1 hit for monomerid = 50453018
TargetAmine oxidase [flavin-containing] B(Homo sapiens (Human))
University Of Porto
Curated by ChEMBL
LigandPNGBDBM50453018(CHEMBL4203592)
Affinity DataKi:  31nM. Assay description: Tight-binding competitive inhibition of recombinant human MAO-B expressed in Pichia pastoris using benzylamine as substrate by fluorimetric horseradi...
Ligand InfoPC cidPC sidPDB