BDBM50459943 CHEMBL4225470
SMILES Cc1ncsc1-c1ccc(CNC(=O)[C@@H]2C[C@@H](O)CN2C(=O)[C@@H](NC(=O)C2(F)CC2)C(C)(C)C)cc1
InChI Key InChIKey=GFNCBUDQFXZVNN-SVFBPWRDSA-N
Data  4 Kd
PDB links: 1 PDB ID matches this monomer.
  Tab Delimited (TSV)   2D SDfile   Computed 3D by Vconf -m prep SDfile
Find this compound or compounds like it in BindingDB:
Activity Spreadsheet -- Enzyme Inhibition Constant Data from BindingDB
Found 4 hits for monomerid = 50459943
TargetElongin-C(Homo sapiens (Human))
University Of Dundee
Curated by ChEMBL
LigandPNGBDBM50459943(CHEMBL4225470)
Affinity DataKd:  44nM. Assay description: Binding affinity to VHL (unknown origin)/elongin C (unknown origin)/elongin B (unknown origin) by isothermal titration calorimetry-based assay
TargetElongin-C(Homo sapiens (Human))
University Of Dundee
Curated by ChEMBL
LigandPNGBDBM50459943(CHEMBL4225470)
Affinity DataKd:  24nM. Assay description: Binding affinity to VBC (unknown origin) at 50 uM at 10 degC by surface plasmon resonance assay
TargetElongin-C(Homo sapiens (Human))
University Of Dundee
Curated by ChEMBL
LigandPNGBDBM50459943(CHEMBL4225470)
Affinity DataKd:  16nM. Assay description: Binding affinity to VBC (unknown origin) at 50 uM at 20 degC by surface plasmon resonance assay
TargetElongin-C(Homo sapiens (Human))
University Of Dundee
Curated by ChEMBL
LigandPNGBDBM50459943(CHEMBL4225470)
Affinity DataKd:  90nM. Assay description: Displacement of FAM-labeled HIF-1alpha peptide from VBC (unknown origin) by fluorescence polarization assay