BDBM50460945 CHEMBL4225287
SMILES CC(C)Nc1ccc2ccn(-c3cncc(n3)-c3ccc(cc3)C(O)=O)c2c1
InChI Key InChIKey=OYFRKTHVILHHEH-UHFFFAOYSA-N
Data  4 IC50
  Tab Delimited (TSV)   2D SDfile   Computed 3D by Vconf -m prep SDfile
Find this compound or compounds like it in BindingDB:
Activity Spreadsheet -- Enzyme Inhibition Constant Data from BindingDB
Found 4 hits for monomerid = 50460945
TargetCasein kinase II subunit alpha(Homo sapiens (Human))
Astrazeneca
Curated by ChEMBL
LigandPNGBDBM50460945(CHEMBL4225287)
Affinity DataIC50:  3nM. Assay description: Inhibition of recombinant human full length N-terminal His6-tagged CK2alpha expressed in Sf21 insect cells using CK2tide as substrate treated for 20 ...
Ligand InfoPC cidPC sid
In DepthDetails ArticlePubMed
TargetCasein kinase II subunit alpha(Homo sapiens (Human))
Astrazeneca
Curated by ChEMBL
LigandPNGBDBM50460945(CHEMBL4225287)
Affinity DataIC50:  96nM. Assay description: Inhibition of CK2alpha in human HCT116 or human DLD1 cells assessed as decrease in AKT phosphorylation at S129 residue after 3 to 24 hrs by Western b...
Ligand InfoPC cidPC sid
In DepthDetails ArticlePubMed
TargetSerine/threonine-protein kinase pim-2(Homo sapiens (Human))
Astrazeneca
Curated by ChEMBL
LigandPNGBDBM50460945(CHEMBL4225287)
Affinity DataIC50:  1.00E+4nM. Assay description: Inhibition of human PIM2
Ligand InfoPC cidPC sid
In DepthDetails ArticlePubMed
TargetSerine/threonine-protein kinase pim-1(Homo sapiens (Human))
Astrazeneca
Curated by ChEMBL
LigandPNGBDBM50460945(CHEMBL4225287)
Affinity DataIC50:  1.20E+3nM. Assay description: Inhibition of human PIM1
Ligand InfoPC cidPC sid
In DepthDetails ArticlePubMed