BDBM50467882 CHEMBL4284619
SMILES CCN1CCN(CC1)C1CCN(CC1)C(=O)COc1ccc(cc1)-c1ccc(OC)cc1
InChI Key InChIKey=HQHBRBVCWLKIRI-UHFFFAOYSA-N
Data  4 IC50
PDB links: 1 PDB ID matches this monomer.
  Tab Delimited (TSV)   2D SDfile   Computed 3D by Vconf -m prep SDfile
Find this compound or compounds like it in BindingDB:
Activity Spreadsheet -- Enzyme Inhibition Constant Data from BindingDB
Found 4 hits for monomerid = 50467882
TargetAcetylcholinesterase(Anopheles gambiae)
Umea University
Curated by ChEMBL
LigandPNGBDBM50467882(CHEMBL4284619)
Affinity DataIC50:  960nM. Assay description: Inhibition of recombinant Anopheles gambiae AChE1 G122S mutant expressed in sf9 insect cells using acetylthiocholine iodide as substrate measured ove...
Ligand InfoPC cidPC sidPDB
In DepthDetails ArticlePubMed
TargetAcetylcholinesterase(Anopheles gambiae)
Umea University
Curated by ChEMBL
LigandPNGBDBM50467882(CHEMBL4284619)
Affinity DataIC50:  400nM. Assay description: Inhibition of recombinant Anopheles gambiae AChE1 expressed in sf9 insect cells using acetylthiocholine iodide as substrate measured over 60 secs by ...
Ligand InfoPC cidPC sidPDB
In DepthDetails ArticlePubMed
TargetAcetylcholinesterase(Aedes aegypti)
Umea University
Curated by ChEMBL
LigandPNGBDBM50467882(CHEMBL4284619)
Affinity DataIC50:  230nM. Assay description: Inhibition of recombinant Aedes aegypti AChE1 expressed in sf9 insect cells using acetylthiocholine iodide as substrate measured over 60 secs by Ellm...
Ligand InfoPC cidPC sidPDB
In DepthDetails ArticlePubMed
TargetAcetylcholinesterase(Homo sapiens (Human))
Umea University
Curated by ChEMBL
LigandPNGBDBM50467882(CHEMBL4284619)
Affinity DataIC50:  1.80E+4nM. Assay description: Inhibition of recombinant human AChE using acetylthiocholine iodide as substrate measured over 60 secs by Ellman assay
Ligand InfoPC cidPC sidPDB