BDBM50490987 CHEMBL2376668
SMILES NC(=O)c1c(Nc2ccc(I)cc2F)cc(F)cc1OCC[C@@H](O)CO
InChI Key InChIKey=HNTGGMMWHHPHAE-LLVKDONJSA-N
Data  1 IC50
PDB links: 1 PDB ID matches this monomer.
  Tab Delimited (TSV)   2D SDfile   Computed 3D by Vconf -m prep SDfile
Find this compound or compounds like it in BindingDB:
Activity Spreadsheet -- Enzyme Inhibition Constant Data from BindingDB
Found 1 hit for monomerid = 50490987
TargetDual specificity mitogen-activated protein kinase kinase 1(Homo sapiens (Human))
Bayer Healthcare
Curated by ChEMBL
LigandPNGBDBM50490987(CHEMBL2376668)
Affinity DataIC50:  63nM. Assay description: Inhibition of MEK1 (unknown origin) after 2 hrs by fluorescence assay
Ligand InfoPC cidPC sidPDB