BDBM50492933 CHEMBL2414304
SMILES CCCCCCCCc1nc([nH]c(=O)c1Br)-c1cc(ccc1OCC)S(=O)(=O)N1CCN(C)CC1
InChI Key InChIKey=RHPCTAOHQBBFKL-UHFFFAOYSA-N
Data  1 IC50
PDB links: 1 PDB ID matches this monomer.
  Tab Delimited (TSV)   2D SDfile   Computed 3D by Vconf -m prep SDfile
Find this compound or compounds like it in BindingDB:
Activity Spreadsheet -- Enzyme Inhibition Constant Data from BindingDB
Found 1 hit for monomerid = 50492933
TargetcGMP-specific 3',5'-cyclic phosphodiesterase(Homo sapiens (Human))
Chinese Academy Of Sciences
Curated by ChEMBL
LigandPNGBDBM50492933(CHEMBL2414304)
Affinity DataIC50:  77nM. Assay description: Inhibition of PDE5 (unknown origin)
Ligand InfoPC cidPC sidPDB