BDBM50511649 CHEMBL1727323
SMILES Clc1nccc(NCc2ccccc2)c1C#N
InChI Key InChIKey=CITZANXHXWMHOG-UHFFFAOYSA-N
Data  1 IC50
PDB links: 1 PDB ID matches this monomer.
  Tab Delimited (TSV)   2D SDfile   Computed 3D by Vconf -m prep SDfile
Find this compound or compounds like it in BindingDB:
Activity Spreadsheet -- Enzyme Inhibition Constant Data from BindingDB
Found 1 hit for monomerid = 50511649
TargetB-cell lymphoma 6 protein(Homo sapiens)
TBA
Curated by ChEMBL
LigandPNGBDBM50511649(CHEMBL1727323)
Affinity DataIC50:  1.20E+5nM. Assay description: Displacement of Alexa Fluor 633 C5 maleimide-tagged BCOR from recombinant His-tagged human BCL6 (5 to 129 residues) expressed in Escherichia coli BL2...