BDBM51823 MLS000665472::N'-mesityl-N-methyl-oxamide::N-mesityl-N'-methylethanediamide::N-methyl-N'-(2,4,6-trimethylphenyl)ethanediamide::N-methyl-N'-(2,4,6-trimethylphenyl)oxamide::SMR000270718::cid_2291672
SMILES CNC(=O)C(=O)Nc1c(C)cc(C)cc1C
InChI Key InChIKey=ZUFZKMHHUFQCRV-UHFFFAOYSA-N
Data  2 EC50
  Tab Delimited (TSV)   2D SDfile   Computed 3D by Vconf -m prep SDfile
Find this compound or compounds like it in BindingDB:
Activity Spreadsheet -- Enzyme Inhibition Constant Data from BindingDB
Found 2 hits for monomerid = 51823
LigandPNGBDBM51823(MLS000665472 | N'-mesityl-N-methyl-oxamide | N-mes...)
Affinity DataEC50:  3.00E+4nM. Assay description: University of New Mexico Assay Overview: Assay Support: 1R03MH084830-01 Project Title: TR-FRET HTS Assay for Inhibitors of MEKK2-MEK5 PB1 Domain...
In DepthDetails PCBioAssay
LigandPNGBDBM51823(MLS000665472 | N'-mesityl-N-methyl-oxamide | N-mes...)
Affinity DataEC50:  3.00E+4nM. Assay description: University of New Mexico Assay Overview: Assay Support: 1R03MH084830-01 Project Title: TR-FRET HTS Assay for Inhibitors of MEKK2-MEK5 PB1 Domain...
In DepthDetails PCBioAssay