BDBM53523 7-methoxy-3-(2-oxolanylmethyl)-5H-pyrimido[5,4-b]indol-4-one::7-methoxy-3-(oxolan-2-ylmethyl)-5H-pyrimido[5,4-b]indol-4-one::7-methoxy-3-(tetrahydrofurfuryl)-5H-pyrimid[5,4-b]indol-4-one::MLS000081137::SMR000043025::cid_662474
SMILES COc1ccc2c(c1)[nH]c1c2ncn(CC2CCCO2)c1=O
InChI Key InChIKey=NGLKFYWQAXOIRN-UHFFFAOYSA-N
Data  1 IC50
  Tab Delimited (TSV)   2D SDfile   Computed 3D by Vconf -m prep SDfile
Find this compound or compounds like it in BindingDB:
Activity Spreadsheet -- Enzyme Inhibition Constant Data from BindingDB
Found 1 hit for monomerid = 53523
TargetTyrosine-protein phosphatase non-receptor type 7(Homo sapiens (Human))
Burnham Center For Chemical Genomics
Curated by PubChem BioAssay
LigandPNGBDBM53523(7-methoxy-3-(2-oxolanylmethyl)-5H-pyrimido[5,4-b]i...)
Affinity DataIC50:  1.00E+5nM. Assay description: Data Source: Sanford-Burnham Center for Chemical Genomics (SBCCG) Source Affiliation: Sanford-Burnham Medical Research Institute (SBMRI, San Diego, C...
In DepthDetails PCBioAssay